{"text_format":"1","workbook":"xlsx","n_sheets":4,"sheets":["Import","View","Data","Meas0002"],"not_rendered":{"charts":2,"images":1,"macros":1,"external_links":0,"defined_names":7,"comments":0,"pivot_tables":0},"unopened":[],"bounds":{"document_bytes":16777216,"sheet_cells":100000,"rows_first":2000,"rows_last":500,"rows_between":2000,"halvings":0,"cell_chars":16384,"cell_head_chars":4096},"cells_cut":0,"cells_raw":0,"read":"whole","date_system":"1900"}

{"sheet":"Import","index":0,"n_rows":21,"n_cols":1,"rows_kept":21,"cut":false,"hidden":false,"merged":[]}
["LEQ Data import"]
[]
[]
[]
[]
["How does this worksheet work?"]
["This worksheet allows you to import LEQ measurements stored on the Bedrock SMxx. Make sure that the LEQ result files are copied onto your computer, or that the instrument is attached to USB and accessible as a mass storage device. The LEQ files are stored in the LAEQ folder for backard compatibility. Then press the button below (\"Import LEQ\"). You can now select the measurement data files that you wish to import. NOTE: by using SHIFT and CTRL you can select multiple files for opening. The measurements are imported into the sheet named \"Data.\" Use the sheet named \"View\" to browse through these measurements, or copy data directly from the \"Data\" sheet to your own Worksheet for further calculations. Note that importing data changes this worksheet, overwriting earlier data imports. We recommend that you keep the original version of this worksheet in a safe location, and that you use a new copy of this original file for each new project."]
[]
[]
[]
["For support or to download the latest version of this file, please refer to our website"]
["www.bedrock-audio.com"]
[]
["Version 2.6.0"]
[]
[]
["COPYRIGHT (C) Embedded Acoustics BV, 2020"]
["ALL RIGHTS RESERVED. This worksheet contains material protected under International and Federal Copyright Laws and Treaties. Any unauthorized use of this material is prohibited. No part of this worksheet may be reproduced or transmitted in any form or by any means, electronic or mechanical, including photocopying, recording, or by any information storage and retrieval system without express written permission from the author. "]
[" "]
["DISCLAIMER"]
["THIS DOCUMENT IS PROVIDED \"AS IS\", WITHOUT WARRANTY OF ANY KIND, EXPRESS OR IMPLIED, INCLUDING BUT NOT LIMITED TO THE WARRANTIES OF MERCHANTABILITY, FITNESS FOR A PARTICULAR PURPOSE AND NONINFRINGEMENT. IN NO EVENT SHALL THE AUTHORS OR COPYRIGHT HOLDERS BE LIABLE FOR ANY CLAIM, DAMAGES OR OTHER LIABILITY, WHETHER IN AN ACTION OF CONTRACT, TORT OR OTHERWISE, ARISING FROM, OUT OF OR IN CONNECTION WITH THE SOFTWARE OR THE USE OR OTHER DEALINGS IN THE SOFTWARE"]

{"sheet":"View","index":1,"n_rows":105,"n_cols":25,"rows_kept":105,"cut":false,"hidden":false,"merged":[]}
["LEQ measurement",null,null,null,null,null,null,null,null,null,"Data point time","Averaging time",{"$f":"CONCATENATE(\"LAEQ \", $B$6,\" min\")","v":"LAEQ 15 min"},{"$f":"CONCATENATE(\"LAEQ \", $B$7,\" sec\")","v":"LAEQ 1 sec"},"10^(Li/10)","LAEQ Limit exceeded",{"$f":"CONCATENATE(\"LCEQ \", $B$6,\" min\")","v":"LCEQ 15 min"},{"$f":"CONCATENATE(\"LCEQ \", $B$7,\" sec\")","v":"LCEQ 1 sec"},"LCEQ Limit exceeded",{"$f":"CONCATENATE(\"LZEQ \", $B$6,\" min\")","v":"LZEQ 15 min"},{"$f":"CONCATENATE(\"LZEQ \", $B$7,\" sec\")","v":"LZEQ 1 sec"},"LZEQ Limit exceeded"]
[null,null,null,null,null,null,null,null,null,null,{"$f":"IF(OFFSET(Data!A5,0,(View!$B$27-1)*12)<>\"\",$B$3 + OFFSET(Data!A5,0,(View!$B$27-1)*12),\"\")","v":44474.391157407408},{"$f":"IF(OFFSET(Data!B5,0,(View!$B$27-1)*12)<>\"\",OFFSET(Data!B5,0,(View!$B$27-1)*12),\"\")","v":1},{"$f":"IF(OFFSET(Data!C5,0,(View!$B$27-1)*12)<>\"\",OFFSET(Data!C5,0,(View!$B$27-1)*12),\"\")","v":46.546399999999998},{"$f":"IF(OFFSET(Data!D5,0,(View!$B$27-1)*12)<>\"\",OFFSET(Data!D5,0,(View!$B$27-1)*12),\"\")","v":46.546399999999998},{"$f":"10^(N2/10)","v":45148.15423388077},{"$f":"IF(M2<>\"\",IF(M2<$B$8,IF(N2<$B$8,\"OK\",\"Current\"),\"Average\"),\"\")","v":"OK"},{"$f":"IF(OFFSET(Data!F5,0,(View!$B$27-1)*12)<>\"\",OFFSET(Data!F5,0,(View!$B$27-1)*12),IF($M2<>\"\",#N/A,\"\"))","v":57.599080000000001},{"$f":"IF(OFFSET(Data!G5,0,(View!$B$27-1)*12)<>\"\",OFFSET(Data!G5,0,(View!$B$27-1)*12),IF($N2<>\"\",#N/A,\"\"))","v":57.599080000000001},{"$f":"IF(Q2<>\"\",IF(Q2<$B$8,IF(R2<$B$8,\"OK\",\"Current\"),\"Average\"),\"\")","v":"OK"},{"$f":"IF(OFFSET(Data!I5,0,(View!$B$27-1)*12)<>\"\",OFFSET(Data!I5,0,(View!$B$27-1)*12),IF($M2<>\"\",#N/A,\"\"))","v":62.182160000000003},{"$f":"IF(OFFSET(Data!J5,0,(View!$B$27-1)*12)<>\"\",OFFSET(Data!J5,0,(View!$B$27-1)*12),IF($N2<>\"\",#N/A,\"\"))","v":62.182160000000003},{"$f":"IF(T2<>\"\",IF(T2<$B$8,IF(U2<$B$8,\"OK\",\"Current\"),\"Average\"),\"\")","v":"OK"},"Laeq=10*log10((10^(L1/10)+10^(L2/10)+….+10^(Ln/10))/n)"]
["Date",{"$f":"OFFSET(Data!B2,0,(View!$B$27-1)*12)","v":"2021-10-05"},null,null,null,null,null,null,null,null,{"$f":"IF(OFFSET(Data!A6,0,(View!$B$27-1)*12)<>\"\",$B$3 + OFFSET(Data!A6,0,(View!$B$27-1)*12),\"\")","v":44474.391168981485},{"$f":"IF(OFFSET(Data!B6,0,(View!$B$27-1)*12)<>\"\",OFFSET(Data!B6,0,(View!$B$27-1)*12),\"\")","v":2},{"$f":"IF(OFFSET(Data!C6,0,(View!$B$27-1)*12)<>\"\",OFFSET(Data!C6,0,(View!$B$27-1)*12),\"\")","v":68.796589999999995},{"$f":"IF(OFFSET(Data!D6,0,(View!$B$27-1)*12)<>\"\",OFFSET(Data!D6,0,(View!$B$27-1)*12),\"\")","v":71.793930000000003},{"$f":"10^(N3/10)","v":15114472.682370359},{"$f":"IF(M3<>\"\",IF(M3<$B$8,IF(N3<$B$8,\"OK\",\"Current\"),\"Average\"),\"\")","v":"OK"},{"$f":"IF(OFFSET(Data!F6,0,(View!$B$27-1)*12)<>\"\",OFFSET(Data!F6,0,(View!$B$27-1)*12),IF($M3<>\"\",#N/A,\"\"))","v":72.736440000000002},{"$f":"IF(OFFSET(Data!G6,0,(View!$B$27-1)*12)<>\"\",OFFSET(Data!G6,0,(View!$B$27-1)*12),IF($N3<>\"\",#N/A,\"\"))","v":75.679699999999997},{"$f":"IF(Q3<>\"\",IF(Q3<$B$8,IF(R3<$B$8,\"OK\",\"Current\"),\"Average\"),\"\")","v":"OK"},{"$f":"IF(OFFSET(Data!I6,0,(View!$B$27-1)*12)<>\"\",OFFSET(Data!I6,0,(View!$B$27-1)*12),IF($M3<>\"\",#N/A,\"\"))","v":72.947109999999995},{"$f":"IF(OFFSET(Data!J6,0,(View!$B$27-1)*12)<>\"\",OFFSET(Data!J6,0,(View!$B$27-1)*12),IF($N3<>\"\",#N/A,\"\"))","v":75.771389999999997},{"$f":"IF(T3<>\"\",IF(T3<$B$8,IF(U3<$B$8,\"OK\",\"Current\"),\"Average\"),\"\")","v":"OK"},"Laeq =",{"$f":"10*LOG10(SUM(O2:O105)/COUNT(O2:O105))","v":74.714982682509557},"dB(A)"]
["Time",{"$f":"OFFSET(Data!C2,0,(View!$B$27-1)*12)","v":"09:23:14"},null,null,null,null,null,null,null,null,{"$f":"IF(OFFSET(Data!A7,0,(View!$B$27-1)*12)<>\"\",$B$3 + OFFSET(Data!A7,0,(View!$B$27-1)*12),\"\")","v":44474.391180555554},{"$f":"IF(OFFSET(Data!B7,0,(View!$B$27-1)*12)<>\"\",OFFSET(Data!B7,0,(View!$B$27-1)*12),\"\")","v":3},{"$f":"IF(OFFSET(Data!C7,0,(View!$B$27-1)*12)<>\"\",OFFSET(Data!C7,0,(View!$B$27-1)*12),\"\")","v":73.939350000000005},{"$f":"IF(OFFSET(Data!D7,0,(View!$B$27-1)*12)<>\"\",OFFSET(Data!D7,0,(View!$B$27-1)*12),\"\")","v":77.719679999999997},59151804.790925719,"OK",{"$f":"IF(OFFSET(Data!F7,0,(View!$B$27-1)*12)<>\"\",OFFSET(Data!F7,0,(View!$B$27-1)*12),IF($M4<>\"\",#N/A,\"\"))","v":77.109639999999999},{"$f":"IF(OFFSET(Data!G7,0,(View!$B$27-1)*12)<>\"\",OFFSET(Data!G7,0,(View!$B$27-1)*12),IF($N4<>\"\",#N/A,\"\"))","v":80.668660000000003},"OK",{"$f":"IF(OFFSET(Data!I7,0,(View!$B$27-1)*12)<>\"\",OFFSET(Data!I7,0,(View!$B$27-1)*12),IF($M4<>\"\",#N/A,\"\"))","v":77.184200000000004},{"$f":"IF(OFFSET(Data!J7,0,(View!$B$27-1)*12)<>\"\",OFFSET(Data!J7,0,(View!$B$27-1)*12),IF($N4<>\"\",#N/A,\"\"))","v":80.698480000000004},"OK","T =",{"$f":"COUNT(O2:O105)","v":104},"s"]
[null,null,null,null,null,null,null,null,null,null,{"$f":"IF(OFFSET(Data!A8,0,(View!$B$27-1)*12)<>\"\",$B$3 + OFFSET(Data!A8,0,(View!$B$27-1)*12),\"\")","v":44474.391192129631},{"$f":"IF(OFFSET(Data!B8,0,(View!$B$27-1)*12)<>\"\",OFFSET(Data!B8,0,(View!$B$27-1)*12),\"\")","v":4},{"$f":"IF(OFFSET(Data!C8,0,(View!$B$27-1)*12)<>\"\",OFFSET(Data!C8,0,(View!$B$27-1)*12),\"\")","v":74.125870000000006},{"$f":"IF(OFFSET(Data!D8,0,(View!$B$27-1)*12)<>\"\",OFFSET(Data!D8,0,(View!$B$27-1)*12),\"\")","v":74.641710000000003},29118634.154522121,"OK",{"$f":"IF(OFFSET(Data!F8,0,(View!$B$27-1)*12)<>\"\",OFFSET(Data!F8,0,(View!$B$27-1)*12),IF($M5<>\"\",#N/A,\"\"))","v":77.097790000000003},{"$f":"IF(OFFSET(Data!G8,0,(View!$B$27-1)*12)<>\"\",OFFSET(Data!G8,0,(View!$B$27-1)*12),IF($N5<>\"\",#N/A,\"\"))","v":77.062020000000004},"OK",{"$f":"IF(OFFSET(Data!I8,0,(View!$B$27-1)*12)<>\"\",OFFSET(Data!I8,0,(View!$B$27-1)*12),IF($M5<>\"\",#N/A,\"\"))","v":77.182590000000005},{"$f":"IF(OFFSET(Data!J8,0,(View!$B$27-1)*12)<>\"\",OFFSET(Data!J8,0,(View!$B$27-1)*12),IF($N5<>\"\",#N/A,\"\"))","v":77.177710000000005},"OK"]
["Running average time (min)",{"$f":"MAX(OFFSET(Data!D2,0,(View!$B$27-1)*12), 1)","v":15},null,null,null,null,null,null,null,null,{"$f":"IF(OFFSET(Data!A9,0,(View!$B$27-1)*12)<>\"\",$B$3 + OFFSET(Data!A9,0,(View!$B$27-1)*12),\"\")","v":44474.391203703701},{"$f":"IF(OFFSET(Data!B9,0,(View!$B$27-1)*12)<>\"\",OFFSET(Data!B9,0,(View!$B$27-1)*12),\"\")","v":5},{"$f":"IF(OFFSET(Data!C9,0,(View!$B$27-1)*12)<>\"\",OFFSET(Data!C9,0,(View!$B$27-1)*12),\"\")","v":73.371359999999996},{"$f":"IF(OFFSET(Data!D9,0,(View!$B$27-1)*12)<>\"\",OFFSET(Data!D9,0,(View!$B$27-1)*12),\"\")","v":67.192530000000005},5239055.5099360738,"OK",{"$f":"IF(OFFSET(Data!F9,0,(View!$B$27-1)*12)<>\"\",OFFSET(Data!F9,0,(View!$B$27-1)*12),IF($M6<>\"\",#N/A,\"\"))","v":76.437520000000006},{"$f":"IF(OFFSET(Data!G9,0,(View!$B$27-1)*12)<>\"\",OFFSET(Data!G9,0,(View!$B$27-1)*12),IF($N6<>\"\",#N/A,\"\"))","v":71.79307},"OK",{"$f":"IF(OFFSET(Data!I9,0,(View!$B$27-1)*12)<>\"\",OFFSET(Data!I9,0,(View!$B$27-1)*12),IF($M6<>\"\",#N/A,\"\"))","v":76.538889999999995},{"$f":"IF(OFFSET(Data!J9,0,(View!$B$27-1)*12)<>\"\",OFFSET(Data!J9,0,(View!$B$27-1)*12),IF($N6<>\"\",#N/A,\"\"))","v":72.113399999999999},"OK"]
["Current average time (sec)",{"$f":"MAX(OFFSET(Data!E2,0,(View!$B$27-1)*12), 1)","v":1},null,null,null,null,null,null,null,null,{"$f":"IF(OFFSET(Data!A10,0,(View!$B$27-1)*12)<>\"\",$B$3 + OFFSET(Data!A10,0,(View!$B$27-1)*12),\"\")","v":44474.391215277778},{"$f":"IF(OFFSET(Data!B10,0,(View!$B$27-1)*12)<>\"\",OFFSET(Data!B10,0,(View!$B$27-1)*12),\"\")","v":6},{"$f":"IF(OFFSET(Data!C10,0,(View!$B$27-1)*12)<>\"\",OFFSET(Data!C10,0,(View!$B$27-1)*12),\"\")","v":72.628799999999998},{"$f":"IF(OFFSET(Data!D10,0,(View!$B$27-1)*12)<>\"\",OFFSET(Data!D10,0,(View!$B$27-1)*12),\"\")","v":60.932110000000002},1239398.5964511884,"OK",{"$f":"IF(OFFSET(Data!F10,0,(View!$B$27-1)*12)<>\"\",OFFSET(Data!F10,0,(View!$B$27-1)*12),IF($M7<>\"\",#N/A,\"\"))","v":75.765230000000003},{"$f":"IF(OFFSET(Data!G10,0,(View!$B$27-1)*12)<>\"\",OFFSET(Data!G10,0,(View!$B$27-1)*12),IF($N7<>\"\",#N/A,\"\"))","v":67.883740000000003},"OK",{"$f":"IF(OFFSET(Data!I10,0,(View!$B$27-1)*12)<>\"\",OFFSET(Data!I10,0,(View!$B$27-1)*12),IF($M7<>\"\",#N/A,\"\"))","v":75.878200000000007},{"$f":"IF(OFFSET(Data!J10,0,(View!$B$27-1)*12)<>\"\",OFFSET(Data!J10,0,(View!$B$27-1)*12),IF($N7<>\"\",#N/A,\"\"))","v":68.393289999999993},"OK"]
["LEQ warning limit (dBA)",{"$f":"OFFSET(Data!F2,0,(View!$B$27-1)*12)","v":105},null,null,null,null,null,null,null,null,{"$f":"IF(OFFSET(Data!A11,0,(View!$B$27-1)*12)<>\"\",$B$3 + OFFSET(Data!A11,0,(View!$B$27-1)*12),\"\")","v":44474.391226851854},{"$f":"IF(OFFSET(Data!B11,0,(View!$B$27-1)*12)<>\"\",OFFSET(Data!B11,0,(View!$B$27-1)*12),\"\")","v":7},{"$f":"IF(OFFSET(Data!C11,0,(View!$B$27-1)*12)<>\"\",OFFSET(Data!C11,0,(View!$B$27-1)*12),\"\")","v":72.102789999999999},{"$f":"IF(OFFSET(Data!D11,0,(View!$B$27-1)*12)<>\"\",OFFSET(Data!D11,0,(View!$B$27-1)*12),\"\")","v":65.671570000000003},3691110.1024719388,"OK",{"$f":"IF(OFFSET(Data!F11,0,(View!$B$27-1)*12)<>\"\",OFFSET(Data!F11,0,(View!$B$27-1)*12),IF($M8<>\"\",#N/A,\"\"))","v":75.239639999999994},{"$f":"IF(OFFSET(Data!G11,0,(View!$B$27-1)*12)<>\"\",OFFSET(Data!G11,0,(View!$B$27-1)*12),IF($N8<>\"\",#N/A,\"\"))","v":68.821150000000003},"OK",{"$f":"IF(OFFSET(Data!I11,0,(View!$B$27-1)*12)<>\"\",OFFSET(Data!I11,0,(View!$B$27-1)*12),IF($M8<>\"\",#N/A,\"\"))","v":75.368449999999996},{"$f":"IF(OFFSET(Data!J11,0,(View!$B$27-1)*12)<>\"\",OFFSET(Data!J11,0,(View!$B$27-1)*12),IF($N8<>\"\",#N/A,\"\"))","v":69.395359999999997},"OK"]
[null,null,null,null,null,null,null,null,null,null,{"$f":"IF(OFFSET(Data!A12,0,(View!$B$27-1)*12)<>\"\",$B$3 + OFFSET(Data!A12,0,(View!$B$27-1)*12),\"\")","v":44474.391238425924},{"$f":"IF(OFFSET(Data!B12,0,(View!$B$27-1)*12)<>\"\",OFFSET(Data!B12,0,(View!$B$27-1)*12),\"\")","v":8},{"$f":"IF(OFFSET(Data!C12,0,(View!$B$27-1)*12)<>\"\",OFFSET(Data!C12,0,(View!$B$27-1)*12),\"\")","v":71.531270000000006},{"$f":"IF(OFFSET(Data!D12,0,(View!$B$27-1)*12)<>\"\",OFFSET(Data!D12,0,(View!$B$27-1)*12),\"\")","v":53.426020000000001},220090.85624232332,"OK",{"$f":"IF(OFFSET(Data!F12,0,(View!$B$27-1)*12)<>\"\",OFFSET(Data!F12,0,(View!$B$27-1)*12),IF($M9<>\"\",#N/A,\"\"))","v":74.681880000000007},{"$f":"IF(OFFSET(Data!G12,0,(View!$B$27-1)*12)<>\"\",OFFSET(Data!G12,0,(View!$B$27-1)*12),IF($N9<>\"\",#N/A,\"\"))","v":60.778889999999997},"OK",{"$f":"IF(OFFSET(Data!I12,0,(View!$B$27-1)*12)<>\"\",OFFSET(Data!I12,0,(View!$B$27-1)*12),IF($M9<>\"\",#N/A,\"\"))","v":74.828680000000006},{"$f":"IF(OFFSET(Data!J12,0,(View!$B$27-1)*12)<>\"\",OFFSET(Data!J12,0,(View!$B$27-1)*12),IF($N9<>\"\",#N/A,\"\"))","v":63.498330000000003},"OK"]
["Number of measurements",{"$f":"MAX(COUNTIF(M2:INDEX(M:M,COUNT(M:M)+1),  \"<>\" & \"*\"),1)","v":104},null,null,null,null,null,null,null,null,{"$f":"IF(OFFSET(Data!A13,0,(View!$B$27-1)*12)<>\"\",$B$3 + OFFSET(Data!A13,0,(View!$B$27-1)*12),\"\")","v":44474.391250000001},{"$f":"IF(OFFSET(Data!B13,0,(View!$B$27-1)*12)<>\"\",OFFSET(Data!B13,0,(View!$B$27-1)*12),\"\")","v":9},{"$f":"IF(OFFSET(Data!C13,0,(View!$B$27-1)*12)<>\"\",OFFSET(Data!C13,0,(View!$B$27-1)*12),\"\")","v":71.063419999999994},{"$f":"IF(OFFSET(Data!D13,0,(View!$B$27-1)*12)<>\"\",OFFSET(Data!D13,0,(View!$B$27-1)*12),\"\")","v":60.608260000000001},1150339.4133427145,"OK",{"$f":"IF(OFFSET(Data!F13,0,(View!$B$27-1)*12)<>\"\",OFFSET(Data!F13,0,(View!$B$27-1)*12),IF($M10<>\"\",#N/A,\"\"))","v":74.259479999999996},{"$f":"IF(OFFSET(Data!G13,0,(View!$B$27-1)*12)<>\"\",OFFSET(Data!G13,0,(View!$B$27-1)*12),IF($N10<>\"\",#N/A,\"\"))","v":66.879459999999995},"OK",{"$f":"IF(OFFSET(Data!I13,0,(View!$B$27-1)*12)<>\"\",OFFSET(Data!I13,0,(View!$B$27-1)*12),IF($M10<>\"\",#N/A,\"\"))","v":74.425129999999996},{"$f":"IF(OFFSET(Data!J13,0,(View!$B$27-1)*12)<>\"\",OFFSET(Data!J13,0,(View!$B$27-1)*12),IF($N10<>\"\",#N/A,\"\"))","v":67.869200000000006},"OK"]
[null,null,null,null,null,null,null,null,null,null,{"$f":"IF(OFFSET(Data!A14,0,(View!$B$27-1)*12)<>\"\",$B$3 + OFFSET(Data!A14,0,(View!$B$27-1)*12),\"\")","v":44474.391261574077},{"$f":"IF(OFFSET(Data!B14,0,(View!$B$27-1)*12)<>\"\",OFFSET(Data!B14,0,(View!$B$27-1)*12),\"\")","v":10},{"$f":"IF(OFFSET(Data!C14,0,(View!$B$27-1)*12)<>\"\",OFFSET(Data!C14,0,(View!$B$27-1)*12),\"\")","v":70.79804},{"$f":"IF(OFFSET(Data!D14,0,(View!$B$27-1)*12)<>\"\",OFFSET(Data!D14,0,(View!$B$27-1)*12),\"\")","v":67.161799999999999},5202115.6150793945,"OK",{"$f":"IF(OFFSET(Data!F14,0,(View!$B$27-1)*12)<>\"\",OFFSET(Data!F14,0,(View!$B$27-1)*12),IF($M11<>\"\",#N/A,\"\"))","v":73.995859999999993},{"$f":"IF(OFFSET(Data!G14,0,(View!$B$27-1)*12)<>\"\",OFFSET(Data!G14,0,(View!$B$27-1)*12),IF($N11<>\"\",#N/A,\"\"))","v":70.398409999999998},"OK",{"$f":"IF(OFFSET(Data!I14,0,(View!$B$27-1)*12)<>\"\",OFFSET(Data!I14,0,(View!$B$27-1)*12),IF($M11<>\"\",#N/A,\"\"))","v":74.175330000000002},{"$f":"IF(OFFSET(Data!J14,0,(View!$B$27-1)*12)<>\"\",OFFSET(Data!J14,0,(View!$B$27-1)*12),IF($N11<>\"\",#N/A,\"\"))","v":70.869820000000004},"OK"]
["Data per frequency weighting","LAEQ","LCEQ","LZEQ",null,null,null,null,null,null,{"$f":"IF(OFFSET(Data!A15,0,(View!$B$27-1)*12)<>\"\",$B$3 + OFFSET(Data!A15,0,(View!$B$27-1)*12),\"\")","v":44474.391273148147},{"$f":"IF(OFFSET(Data!B15,0,(View!$B$27-1)*12)<>\"\",OFFSET(Data!B15,0,(View!$B$27-1)*12),\"\")","v":11},{"$f":"IF(OFFSET(Data!C15,0,(View!$B$27-1)*12)<>\"\",OFFSET(Data!C15,0,(View!$B$27-1)*12),\"\")","v":71.966399999999993},{"$f":"IF(OFFSET(Data!D15,0,(View!$B$27-1)*12)<>\"\",OFFSET(Data!D15,0,(View!$B$27-1)*12),\"\")","v":77.228200000000001},52822627.492881343,"OK",{"$f":"IF(OFFSET(Data!F15,0,(View!$B$27-1)*12)<>\"\",OFFSET(Data!F15,0,(View!$B$27-1)*12),IF($M12<>\"\",#N/A,\"\"))","v":74.654700000000005},{"$f":"IF(OFFSET(Data!G15,0,(View!$B$27-1)*12)<>\"\",OFFSET(Data!G15,0,(View!$B$27-1)*12),IF($N12<>\"\",#N/A,\"\"))","v":78.470529999999997},"OK",{"$f":"IF(OFFSET(Data!I15,0,(View!$B$27-1)*12)<>\"\",OFFSET(Data!I15,0,(View!$B$27-1)*12),IF($M12<>\"\",#N/A,\"\"))","v":74.80489},{"$f":"IF(OFFSET(Data!J15,0,(View!$B$27-1)*12)<>\"\",OFFSET(Data!J15,0,(View!$B$27-1)*12),IF($N12<>\"\",#N/A,\"\"))","v":78.514570000000006},"OK"]
[{"$f":"CONCATENATE(\"LEQ \", $B$6,\" min exceeded?\")","v":"LEQ 15 min exceeded?"},{"$f":"IF(ISNA($M$2), \"\",COUNTIF(rangeLAEQAverage,  \">=\" & $B$8))","v":0},{"$f":"IF(ISNA($Q$2), \"\",COUNTIF(rangeLCEQAverage,  \">=\" & $B$8))","v":0},{"$f":"IF(ISNA($T$2), \"\",COUNTIF(rangeLZEQAverage,  \">=\" & $B$8))","v":0},null,null,null,null,null,null,{"$f":"IF(OFFSET(Data!A16,0,(View!$B$27-1)*12)<>\"\",$B$3 + OFFSET(Data!A16,0,(View!$B$27-1)*12),\"\")","v":44474.391284722224},{"$f":"IF(OFFSET(Data!B16,0,(View!$B$27-1)*12)<>\"\",OFFSET(Data!B16,0,(View!$B$27-1)*12),\"\")","v":12},{"$f":"IF(OFFSET(Data!C16,0,(View!$B$27-1)*12)<>\"\",OFFSET(Data!C16,0,(View!$B$27-1)*12),\"\")","v":71.967699999999994},{"$f":"IF(OFFSET(Data!D16,0,(View!$B$27-1)*12)<>\"\",OFFSET(Data!D16,0,(View!$B$27-1)*12),\"\")","v":71.981989999999996},15783343.195968889,"OK",{"$f":"IF(OFFSET(Data!F16,0,(View!$B$27-1)*12)<>\"\",OFFSET(Data!F16,0,(View!$B$27-1)*12),IF($M13<>\"\",#N/A,\"\"))","v":74.560850000000002},{"$f":"IF(OFFSET(Data!G16,0,(View!$B$27-1)*12)<>\"\",OFFSET(Data!G16,0,(View!$B$27-1)*12),IF($N13<>\"\",#N/A,\"\"))","v":73.367239999999995},"OK",{"$f":"IF(OFFSET(Data!I16,0,(View!$B$27-1)*12)<>\"\",OFFSET(Data!I16,0,(View!$B$27-1)*12),IF($M13<>\"\",#N/A,\"\"))","v":74.710700000000003},{"$f":"IF(OFFSET(Data!J16,0,(View!$B$27-1)*12)<>\"\",OFFSET(Data!J16,0,(View!$B$27-1)*12),IF($N13<>\"\",#N/A,\"\"))","v":73.512020000000007},"OK"]
["Percentage exceeded",{"$f":"IF(ISNA($M$2), \"\",B$13/$B$10)","v":0},{"$f":"IF(ISNA($Q$2), \"\",C$13/$B$10)","v":0},{"$f":"IF(ISNA($T$2), \"\",D$13/$B$10)","v":0},null,null,null,null,null,null,{"$f":"IF(OFFSET(Data!A17,0,(View!$B$27-1)*12)<>\"\",$B$3 + OFFSET(Data!A17,0,(View!$B$27-1)*12),\"\")","v":44474.391296296293},{"$f":"IF(OFFSET(Data!B17,0,(View!$B$27-1)*12)<>\"\",OFFSET(Data!B17,0,(View!$B$27-1)*12),\"\")","v":13},{"$f":"IF(OFFSET(Data!C17,0,(View!$B$27-1)*12)<>\"\",OFFSET(Data!C17,0,(View!$B$27-1)*12),\"\")","v":72.084530000000001},{"$f":"IF(OFFSET(Data!D17,0,(View!$B$27-1)*12)<>\"\",OFFSET(Data!D17,0,(View!$B$27-1)*12),\"\")","v":73.285319999999999},21307475.610410783,"OK",{"$f":"IF(OFFSET(Data!F17,0,(View!$B$27-1)*12)<>\"\",OFFSET(Data!F17,0,(View!$B$27-1)*12),IF($M14<>\"\",#N/A,\"\"))","v":74.619770000000003},{"$f":"IF(OFFSET(Data!G17,0,(View!$B$27-1)*12)<>\"\",OFFSET(Data!G17,0,(View!$B$27-1)*12),IF($N14<>\"\",#N/A,\"\"))","v":75.270780000000002},"OK",{"$f":"IF(OFFSET(Data!I17,0,(View!$B$27-1)*12)<>\"\",OFFSET(Data!I17,0,(View!$B$27-1)*12),IF($M14<>\"\",#N/A,\"\"))","v":74.767719999999997},{"$f":"IF(OFFSET(Data!J17,0,(View!$B$27-1)*12)<>\"\",OFFSET(Data!J17,0,(View!$B$27-1)*12),IF($N14<>\"\",#N/A,\"\"))","v":75.39931},"OK"]
["Total time exceeded",{"$f":"IF(ISNA($M$2), \"\",B$13*$B$7/(24*60*60))","v":"00:00:00"},{"$f":"IF(ISNA($Q$2), \"\",C$13*$B$7/(24*60*60))","v":"00:00:00"},{"$f":"IF(ISNA($T$2), \"\",D$13*$B$7/(24*60*60))","v":"00:00:00"},null,null,null,null,null,null,{"$f":"IF(OFFSET(Data!A18,0,(View!$B$27-1)*12)<>\"\",$B$3 + OFFSET(Data!A18,0,(View!$B$27-1)*12),\"\")","v":44474.39130787037},{"$f":"IF(OFFSET(Data!B18,0,(View!$B$27-1)*12)<>\"\",OFFSET(Data!B18,0,(View!$B$27-1)*12),\"\")","v":14},{"$f":"IF(OFFSET(Data!C18,0,(View!$B$27-1)*12)<>\"\",OFFSET(Data!C18,0,(View!$B$27-1)*12),\"\")","v":72.429969999999997},{"$f":"IF(OFFSET(Data!D18,0,(View!$B$27-1)*12)<>\"\",OFFSET(Data!D18,0,(View!$B$27-1)*12),\"\")","v":75.427189999999996},34891448.554012746,"OK",{"$f":"IF(OFFSET(Data!F18,0,(View!$B$27-1)*12)<>\"\",OFFSET(Data!F18,0,(View!$B$27-1)*12),IF($M15<>\"\",#N/A,\"\"))","v":74.838809999999995},{"$f":"IF(OFFSET(Data!G18,0,(View!$B$27-1)*12)<>\"\",OFFSET(Data!G18,0,(View!$B$27-1)*12),IF($N15<>\"\",#N/A,\"\"))","v":76.985680000000002},"OK",{"$f":"IF(OFFSET(Data!I18,0,(View!$B$27-1)*12)<>\"\",OFFSET(Data!I18,0,(View!$B$27-1)*12),IF($M15<>\"\",#N/A,\"\"))","v":74.984759999999994},{"$f":"IF(OFFSET(Data!J18,0,(View!$B$27-1)*12)<>\"\",OFFSET(Data!J18,0,(View!$B$27-1)*12),IF($N15<>\"\",#N/A,\"\"))","v":77.116439999999997},"OK"]
[{"$f":"CONCATENATE(\"Maximum Level LEQ \", $B$6,\" min\")","v":"Maximum Level LEQ 15 min"},{"$f":"IF(ISNA($M$2), \"\",MAX(rangeLAEQAverage))","v":75.560389999999998},{"$f":"IF(ISNA($Q$2), \"\",MAX(rangeLCEQAverage))","v":77.222359999999995},{"$f":"IF(ISNA($T$2), \"\",MAX(rangeLZEQAverage))","v":77.789140000000003},null,null,null,null,null,null,{"$f":"IF(OFFSET(Data!A19,0,(View!$B$27-1)*12)<>\"\",$B$3 + OFFSET(Data!A19,0,(View!$B$27-1)*12),\"\")","v":44474.391319444447},{"$f":"IF(OFFSET(Data!B19,0,(View!$B$27-1)*12)<>\"\",OFFSET(Data!B19,0,(View!$B$27-1)*12),\"\")","v":15},{"$f":"IF(OFFSET(Data!C19,0,(View!$B$27-1)*12)<>\"\",OFFSET(Data!C19,0,(View!$B$27-1)*12),\"\")","v":72.340040000000002},{"$f":"IF(OFFSET(Data!D19,0,(View!$B$27-1)*12)<>\"\",OFFSET(Data!D19,0,(View!$B$27-1)*12),\"\")","v":70.834770000000006},12119285.039996834,"OK",{"$f":"IF(OFFSET(Data!F19,0,(View!$B$27-1)*12)<>\"\",OFFSET(Data!F19,0,(View!$B$27-1)*12),IF($M16<>\"\",#N/A,\"\"))","v":74.755009999999999},{"$f":"IF(OFFSET(Data!G19,0,(View!$B$27-1)*12)<>\"\",OFFSET(Data!G19,0,(View!$B$27-1)*12),IF($N16<>\"\",#N/A,\"\"))","v":73.371669999999995},"OK",{"$f":"IF(OFFSET(Data!I19,0,(View!$B$27-1)*12)<>\"\",OFFSET(Data!I19,0,(View!$B$27-1)*12),IF($M16<>\"\",#N/A,\"\"))","v":74.903139999999993},{"$f":"IF(OFFSET(Data!J19,0,(View!$B$27-1)*12)<>\"\",OFFSET(Data!J19,0,(View!$B$27-1)*12),IF($N16<>\"\",#N/A,\"\"))","v":73.562629999999999},"OK"]
[{"$f":"CONCATENATE(\"Maximum Level LEQ \",$B$7,\" sec\")","v":"Maximum Level LEQ 1 sec"},{"$f":"IF(ISNA($M$2), \"\",MAX(rangeLAEQCurrent))","v":80.922280000000001},{"$f":"IF(ISNA($Q$2), \"\",MAX(rangeLCEQCurrent))","v":83.22824},{"$f":"IF(ISNA($T$2), \"\",MAX(rangeLZEQCurrent))","v":83.586070000000007},null,null,null,null,null,null,{"$f":"IF(OFFSET(Data!A20,0,(View!$B$27-1)*12)<>\"\",$B$3 + OFFSET(Data!A20,0,(View!$B$27-1)*12),\"\")","v":44474.391331018516},{"$f":"IF(OFFSET(Data!B20,0,(View!$B$27-1)*12)<>\"\",OFFSET(Data!B20,0,(View!$B$27-1)*12),\"\")","v":16},{"$f":"IF(OFFSET(Data!C20,0,(View!$B$27-1)*12)<>\"\",OFFSET(Data!C20,0,(View!$B$27-1)*12),\"\")","v":72.236959999999996},{"$f":"IF(OFFSET(Data!D20,0,(View!$B$27-1)*12)<>\"\",OFFSET(Data!D20,0,(View!$B$27-1)*12),\"\")","v":70.296779999999998},10707251.405536318,"OK",{"$f":"IF(OFFSET(Data!F20,0,(View!$B$27-1)*12)<>\"\",OFFSET(Data!F20,0,(View!$B$27-1)*12),IF($M17<>\"\",#N/A,\"\"))","v":74.671250000000001},{"$f":"IF(OFFSET(Data!G20,0,(View!$B$27-1)*12)<>\"\",OFFSET(Data!G20,0,(View!$B$27-1)*12),IF($N17<>\"\",#N/A,\"\"))","v":73.170910000000006},"OK",{"$f":"IF(OFFSET(Data!I20,0,(View!$B$27-1)*12)<>\"\",OFFSET(Data!I20,0,(View!$B$27-1)*12),IF($M17<>\"\",#N/A,\"\"))","v":74.820629999999994},{"$f":"IF(OFFSET(Data!J20,0,(View!$B$27-1)*12)<>\"\",OFFSET(Data!J20,0,(View!$B$27-1)*12),IF($N17<>\"\",#N/A,\"\"))","v":73.347309999999993},"OK"]
[null,null,null,null,null,null,null,null,null,null,{"$f":"IF(OFFSET(Data!A21,0,(View!$B$27-1)*12)<>\"\",$B$3 + OFFSET(Data!A21,0,(View!$B$27-1)*12),\"\")","v":44474.391342592593},{"$f":"IF(OFFSET(Data!B21,0,(View!$B$27-1)*12)<>\"\",OFFSET(Data!B21,0,(View!$B$27-1)*12),\"\")","v":17},{"$f":"IF(OFFSET(Data!C21,0,(View!$B$27-1)*12)<>\"\",OFFSET(Data!C21,0,(View!$B$27-1)*12),\"\")","v":72.112710000000007},{"$f":"IF(OFFSET(Data!D21,0,(View!$B$27-1)*12)<>\"\",OFFSET(Data!D21,0,(View!$B$27-1)*12),\"\")","v":69.401430000000005},8712504.1906792037,"OK",{"$f":"IF(OFFSET(Data!F21,0,(View!$B$27-1)*12)<>\"\",OFFSET(Data!F21,0,(View!$B$27-1)*12),IF($M18<>\"\",#N/A,\"\"))","v":74.587339999999998},{"$f":"IF(OFFSET(Data!G21,0,(View!$B$27-1)*12)<>\"\",OFFSET(Data!G21,0,(View!$B$27-1)*12),IF($N18<>\"\",#N/A,\"\"))","v":72.962360000000004},"OK",{"$f":"IF(OFFSET(Data!I21,0,(View!$B$27-1)*12)<>\"\",OFFSET(Data!I21,0,(View!$B$27-1)*12),IF($M18<>\"\",#N/A,\"\"))","v":74.740139999999997},{"$f":"IF(OFFSET(Data!J21,0,(View!$B$27-1)*12)<>\"\",OFFSET(Data!J21,0,(View!$B$27-1)*12),IF($N18<>\"\",#N/A,\"\"))","v":73.195279999999997},"OK"]
[null,null,null,null,null,null,null,null,null,null,{"$f":"IF(OFFSET(Data!A22,0,(View!$B$27-1)*12)<>\"\",$B$3 + OFFSET(Data!A22,0,(View!$B$27-1)*12),\"\")","v":44474.39135416667},{"$f":"IF(OFFSET(Data!B22,0,(View!$B$27-1)*12)<>\"\",OFFSET(Data!B22,0,(View!$B$27-1)*12),\"\")","v":18},{"$f":"IF(OFFSET(Data!C22,0,(View!$B$27-1)*12)<>\"\",OFFSET(Data!C22,0,(View!$B$27-1)*12),\"\")","v":71.892660000000006},{"$f":"IF(OFFSET(Data!D22,0,(View!$B$27-1)*12)<>\"\",OFFSET(Data!D22,0,(View!$B$27-1)*12),\"\")","v":62.554029999999997},1800540.9373520794,"OK",{"$f":"IF(OFFSET(Data!F22,0,(View!$B$27-1)*12)<>\"\",OFFSET(Data!F22,0,(View!$B$27-1)*12),IF($M19<>\"\",#N/A,\"\"))","v":74.417320000000004},{"$f":"IF(OFFSET(Data!G22,0,(View!$B$27-1)*12)<>\"\",OFFSET(Data!G22,0,(View!$B$27-1)*12),IF($N19<>\"\",#N/A,\"\"))","v":69.485870000000006},"OK",{"$f":"IF(OFFSET(Data!I22,0,(View!$B$27-1)*12)<>\"\",OFFSET(Data!I22,0,(View!$B$27-1)*12),IF($M19<>\"\",#N/A,\"\"))","v":74.57517},{"$f":"IF(OFFSET(Data!J22,0,(View!$B$27-1)*12)<>\"\",OFFSET(Data!J22,0,(View!$B$27-1)*12),IF($N19<>\"\",#N/A,\"\"))","v":69.913439999999994},"OK"]
[null,null,null,null,null,null,null,null,null,null,{"$f":"IF(OFFSET(Data!A23,0,(View!$B$27-1)*12)<>\"\",$B$3 + OFFSET(Data!A23,0,(View!$B$27-1)*12),\"\")","v":44474.391365740739},{"$f":"IF(OFFSET(Data!B23,0,(View!$B$27-1)*12)<>\"\",OFFSET(Data!B23,0,(View!$B$27-1)*12),\"\")","v":19},{"$f":"IF(OFFSET(Data!C23,0,(View!$B$27-1)*12)<>\"\",OFFSET(Data!C23,0,(View!$B$27-1)*12),\"\")","v":71.859870000000001},{"$f":"IF(OFFSET(Data!D23,0,(View!$B$27-1)*12)<>\"\",OFFSET(Data!D23,0,(View!$B$27-1)*12),\"\")","v":71.222849999999994},13252109.020056294,"OK",{"$f":"IF(OFFSET(Data!F23,0,(View!$B$27-1)*12)<>\"\",OFFSET(Data!F23,0,(View!$B$27-1)*12),IF($M20<>\"\",#N/A,\"\"))","v":74.40943},{"$f":"IF(OFFSET(Data!G23,0,(View!$B$27-1)*12)<>\"\",OFFSET(Data!G23,0,(View!$B$27-1)*12),IF($N20<>\"\",#N/A,\"\"))","v":74.265039999999999},"OK",{"$f":"IF(OFFSET(Data!I23,0,(View!$B$27-1)*12)<>\"\",OFFSET(Data!I23,0,(View!$B$27-1)*12),IF($M20<>\"\",#N/A,\"\"))","v":74.564539999999994},{"$f":"IF(OFFSET(Data!J23,0,(View!$B$27-1)*12)<>\"\",OFFSET(Data!J23,0,(View!$B$27-1)*12),IF($N20<>\"\",#N/A,\"\"))","v":74.368700000000004},"OK"]
[null,null,null,null,null,null,null,null,null,null,{"$f":"IF(OFFSET(Data!A24,0,(View!$B$27-1)*12)<>\"\",$B$3 + OFFSET(Data!A24,0,(View!$B$27-1)*12),\"\")","v":44474.391377314816},{"$f":"IF(OFFSET(Data!B24,0,(View!$B$27-1)*12)<>\"\",OFFSET(Data!B24,0,(View!$B$27-1)*12),\"\")","v":20},{"$f":"IF(OFFSET(Data!C24,0,(View!$B$27-1)*12)<>\"\",OFFSET(Data!C24,0,(View!$B$27-1)*12),\"\")","v":72.129339999999999},{"$f":"IF(OFFSET(Data!D24,0,(View!$B$27-1)*12)<>\"\",OFFSET(Data!D24,0,(View!$B$27-1)*12),\"\")","v":75.439729999999997},34992341.168445289,"OK",{"$f":"IF(OFFSET(Data!F24,0,(View!$B$27-1)*12)<>\"\",OFFSET(Data!F24,0,(View!$B$27-1)*12),IF($M21<>\"\",#N/A,\"\"))","v":74.688090000000003},{"$f":"IF(OFFSET(Data!G24,0,(View!$B$27-1)*12)<>\"\",OFFSET(Data!G24,0,(View!$B$27-1)*12),IF($N21<>\"\",#N/A,\"\"))","v":78.07423},"OK",{"$f":"IF(OFFSET(Data!I24,0,(View!$B$27-1)*12)<>\"\",OFFSET(Data!I24,0,(View!$B$27-1)*12),IF($M21<>\"\",#N/A,\"\"))","v":74.833250000000007},{"$f":"IF(OFFSET(Data!J24,0,(View!$B$27-1)*12)<>\"\",OFFSET(Data!J24,0,(View!$B$27-1)*12),IF($N21<>\"\",#N/A,\"\"))","v":78.137209999999996},"OK"]
[null,null,null,null,null,null,null,null,null,null,{"$f":"IF(OFFSET(Data!A25,0,(View!$B$27-1)*12)<>\"\",$B$3 + OFFSET(Data!A25,0,(View!$B$27-1)*12),\"\")","v":44474.391388888886},{"$f":"IF(OFFSET(Data!B25,0,(View!$B$27-1)*12)<>\"\",OFFSET(Data!B25,0,(View!$B$27-1)*12),\"\")","v":21},{"$f":"IF(OFFSET(Data!C25,0,(View!$B$27-1)*12)<>\"\",OFFSET(Data!C25,0,(View!$B$27-1)*12),\"\")","v":72.140739999999994},{"$f":"IF(OFFSET(Data!D25,0,(View!$B$27-1)*12)<>\"\",OFFSET(Data!D25,0,(View!$B$27-1)*12),\"\")","v":72.362650000000002},17229195.540611722,"OK",{"$f":"IF(OFFSET(Data!F25,0,(View!$B$27-1)*12)<>\"\",OFFSET(Data!F25,0,(View!$B$27-1)*12),IF($M22<>\"\",#N/A,\"\"))","v":74.699439999999996},{"$f":"IF(OFFSET(Data!G25,0,(View!$B$27-1)*12)<>\"\",OFFSET(Data!G25,0,(View!$B$27-1)*12),IF($N22<>\"\",#N/A,\"\"))","v":74.920559999999995},"OK",{"$f":"IF(OFFSET(Data!I25,0,(View!$B$27-1)*12)<>\"\",OFFSET(Data!I25,0,(View!$B$27-1)*12),IF($M22<>\"\",#N/A,\"\"))","v":74.850700000000003},{"$f":"IF(OFFSET(Data!J25,0,(View!$B$27-1)*12)<>\"\",OFFSET(Data!J25,0,(View!$B$27-1)*12),IF($N22<>\"\",#N/A,\"\"))","v":75.18571},"OK"]
[null,null,null,null,null,null,null,null,null,null,{"$f":"IF(OFFSET(Data!A26,0,(View!$B$27-1)*12)<>\"\",$B$3 + OFFSET(Data!A26,0,(View!$B$27-1)*12),\"\")","v":44474.391400462962},{"$f":"IF(OFFSET(Data!B26,0,(View!$B$27-1)*12)<>\"\",OFFSET(Data!B26,0,(View!$B$27-1)*12),\"\")","v":22},{"$f":"IF(OFFSET(Data!C26,0,(View!$B$27-1)*12)<>\"\",OFFSET(Data!C26,0,(View!$B$27-1)*12),\"\")","v":71.952770000000001},{"$f":"IF(OFFSET(Data!D26,0,(View!$B$27-1)*12)<>\"\",OFFSET(Data!D26,0,(View!$B$27-1)*12),\"\")","v":60.473059999999997},1115079.9321942159,"OK",{"$f":"IF(OFFSET(Data!F26,0,(View!$B$27-1)*12)<>\"\",OFFSET(Data!F26,0,(View!$B$27-1)*12),IF($M23<>\"\",#N/A,\"\"))","v":74.523039999999995},{"$f":"IF(OFFSET(Data!G26,0,(View!$B$27-1)*12)<>\"\",OFFSET(Data!G26,0,(View!$B$27-1)*12),IF($N23<>\"\",#N/A,\"\"))","v":65.644069999999999},"OK",{"$f":"IF(OFFSET(Data!I26,0,(View!$B$27-1)*12)<>\"\",OFFSET(Data!I26,0,(View!$B$27-1)*12),IF($M23<>\"\",#N/A,\"\"))","v":74.681839999999994},{"$f":"IF(OFFSET(Data!J26,0,(View!$B$27-1)*12)<>\"\",OFFSET(Data!J26,0,(View!$B$27-1)*12),IF($N23<>\"\",#N/A,\"\"))","v":66.919470000000004},"OK"]
[null,null,null,null,null,null,null,null,null,null,{"$f":"IF(OFFSET(Data!A27,0,(View!$B$27-1)*12)<>\"\",$B$3 + OFFSET(Data!A27,0,(View!$B$27-1)*12),\"\")","v":44474.391412037039},{"$f":"IF(OFFSET(Data!B27,0,(View!$B$27-1)*12)<>\"\",OFFSET(Data!B27,0,(View!$B$27-1)*12),\"\")","v":23},{"$f":"IF(OFFSET(Data!C27,0,(View!$B$27-1)*12)<>\"\",OFFSET(Data!C27,0,(View!$B$27-1)*12),\"\")","v":72.422489999999996},{"$f":"IF(OFFSET(Data!D27,0,(View!$B$27-1)*12)<>\"\",OFFSET(Data!D27,0,(View!$B$27-1)*12),\"\")","v":77.548429999999996},56864732.434230715,"OK",{"$f":"IF(OFFSET(Data!F27,0,(View!$B$27-1)*12)<>\"\",OFFSET(Data!F27,0,(View!$B$27-1)*12),IF($M24<>\"\",#N/A,\"\"))","v":74.959429999999998},{"$f":"IF(OFFSET(Data!G27,0,(View!$B$27-1)*12)<>\"\",OFFSET(Data!G27,0,(View!$B$27-1)*12),IF($N24<>\"\",#N/A,\"\"))","v":79.877489999999995},"OK",{"$f":"IF(OFFSET(Data!I27,0,(View!$B$27-1)*12)<>\"\",OFFSET(Data!I27,0,(View!$B$27-1)*12),IF($M24<>\"\",#N/A,\"\"))","v":75.099689999999995},{"$f":"IF(OFFSET(Data!J27,0,(View!$B$27-1)*12)<>\"\",OFFSET(Data!J27,0,(View!$B$27-1)*12),IF($N24<>\"\",#N/A,\"\"))","v":79.897000000000006},"OK"]
[null,null,null,null,null,null,null,null,null,null,{"$f":"IF(OFFSET(Data!A28,0,(View!$B$27-1)*12)<>\"\",$B$3 + OFFSET(Data!A28,0,(View!$B$27-1)*12),\"\")","v":44474.391423611109},{"$f":"IF(OFFSET(Data!B28,0,(View!$B$27-1)*12)<>\"\",OFFSET(Data!B28,0,(View!$B$27-1)*12),\"\")","v":24},{"$f":"IF(OFFSET(Data!C28,0,(View!$B$27-1)*12)<>\"\",OFFSET(Data!C28,0,(View!$B$27-1)*12),\"\")","v":72.536289999999994},{"$f":"IF(OFFSET(Data!D28,0,(View!$B$27-1)*12)<>\"\",OFFSET(Data!D28,0,(View!$B$27-1)*12),\"\")","v":74.563429999999997},28598483.218070254,"OK",{"$f":"IF(OFFSET(Data!F28,0,(View!$B$27-1)*12)<>\"\",OFFSET(Data!F28,0,(View!$B$27-1)*12),IF($M25<>\"\",#N/A,\"\"))","v":75.05077},{"$f":"IF(OFFSET(Data!G28,0,(View!$B$27-1)*12)<>\"\",OFFSET(Data!G28,0,(View!$B$27-1)*12),IF($N25<>\"\",#N/A,\"\"))","v":76.749660000000006},"OK",{"$f":"IF(OFFSET(Data!I28,0,(View!$B$27-1)*12)<>\"\",OFFSET(Data!I28,0,(View!$B$27-1)*12),IF($M25<>\"\",#N/A,\"\"))","v":75.186940000000007},{"$f":"IF(OFFSET(Data!J28,0,(View!$B$27-1)*12)<>\"\",OFFSET(Data!J28,0,(View!$B$27-1)*12),IF($N25<>\"\",#N/A,\"\"))","v":76.822990000000004},"OK"]
["Filename",{"$f":"OFFSET(Data!A1,0,(View!$B$27-1)*12)","v":"MEAS0002"},null,null,null,"Measurement range","Warning limit",null,null,null,{"$f":"IF(OFFSET(Data!A29,0,(View!$B$27-1)*12)<>\"\",$B$3 + OFFSET(Data!A29,0,(View!$B$27-1)*12),\"\")","v":44474.391435185185},{"$f":"IF(OFFSET(Data!B29,0,(View!$B$27-1)*12)<>\"\",OFFSET(Data!B29,0,(View!$B$27-1)*12),\"\")","v":25},{"$f":"IF(OFFSET(Data!C29,0,(View!$B$27-1)*12)<>\"\",OFFSET(Data!C29,0,(View!$B$27-1)*12),\"\")","v":72.432100000000005},{"$f":"IF(OFFSET(Data!D29,0,(View!$B$27-1)*12)<>\"\",OFFSET(Data!D29,0,(View!$B$27-1)*12),\"\")","v":68.636139999999997},7304895.3734133374,"OK",{"$f":"IF(OFFSET(Data!F29,0,(View!$B$27-1)*12)<>\"\",OFFSET(Data!F29,0,(View!$B$27-1)*12),IF($M26<>\"\",#N/A,\"\"))","v":74.958799999999997},{"$f":"IF(OFFSET(Data!G29,0,(View!$B$27-1)*12)<>\"\",OFFSET(Data!G29,0,(View!$B$27-1)*12),IF($N26<>\"\",#N/A,\"\"))","v":71.827709999999996},"OK",{"$f":"IF(OFFSET(Data!I29,0,(View!$B$27-1)*12)<>\"\",OFFSET(Data!I29,0,(View!$B$27-1)*12),IF($M26<>\"\",#N/A,\"\"))","v":75.096800000000002},{"$f":"IF(OFFSET(Data!J29,0,(View!$B$27-1)*12)<>\"\",OFFSET(Data!J29,0,(View!$B$27-1)*12),IF($N26<>\"\",#N/A,\"\"))","v":72.057360000000003},"OK"]
["Index",2,null,null,null,{"$f":"$K$2","v":44474.391157407408},{"$f":"$B$8","v":105},null,null,null,{"$f":"IF(OFFSET(Data!A30,0,(View!$B$27-1)*12)<>\"\",$B$3 + OFFSET(Data!A30,0,(View!$B$27-1)*12),\"\")","v":44474.391446759262},{"$f":"IF(OFFSET(Data!B30,0,(View!$B$27-1)*12)<>\"\",OFFSET(Data!B30,0,(View!$B$27-1)*12),\"\")","v":26},{"$f":"IF(OFFSET(Data!C30,0,(View!$B$27-1)*12)<>\"\",OFFSET(Data!C30,0,(View!$B$27-1)*12),\"\")","v":72.331620000000001},{"$f":"IF(OFFSET(Data!D30,0,(View!$B$27-1)*12)<>\"\",OFFSET(Data!D30,0,(View!$B$27-1)*12),\"\")","v":68.510249999999999},7096186.1571884165,"OK",{"$f":"IF(OFFSET(Data!F30,0,(View!$B$27-1)*12)<>\"\",OFFSET(Data!F30,0,(View!$B$27-1)*12),IF($M27<>\"\",#N/A,\"\"))","v":74.872569999999996},{"$f":"IF(OFFSET(Data!G30,0,(View!$B$27-1)*12)<>\"\",OFFSET(Data!G30,0,(View!$B$27-1)*12),IF($N27<>\"\",#N/A,\"\"))","v":71.850809999999996},"OK",{"$f":"IF(OFFSET(Data!I30,0,(View!$B$27-1)*12)<>\"\",OFFSET(Data!I30,0,(View!$B$27-1)*12),IF($M27<>\"\",#N/A,\"\"))","v":75.013720000000006},{"$f":"IF(OFFSET(Data!J30,0,(View!$B$27-1)*12)<>\"\",OFFSET(Data!J30,0,(View!$B$27-1)*12),IF($N27<>\"\",#N/A,\"\"))","v":72.149529999999999},"OK"]
[null,null,null,null,null,null,null,null,null,null,{"$f":"IF(OFFSET(Data!A31,0,(View!$B$27-1)*12)<>\"\",$B$3 + OFFSET(Data!A31,0,(View!$B$27-1)*12),\"\")","v":44474.391458333332},{"$f":"IF(OFFSET(Data!B31,0,(View!$B$27-1)*12)<>\"\",OFFSET(Data!B31,0,(View!$B$27-1)*12),\"\")","v":27},{"$f":"IF(OFFSET(Data!C31,0,(View!$B$27-1)*12)<>\"\",OFFSET(Data!C31,0,(View!$B$27-1)*12),\"\")","v":72.180009999999996},{"$f":"IF(OFFSET(Data!D31,0,(View!$B$27-1)*12)<>\"\",OFFSET(Data!D31,0,(View!$B$27-1)*12),\"\")","v":61.006619999999998},1260845.869380736,"OK",{"$f":"IF(OFFSET(Data!F31,0,(View!$B$27-1)*12)<>\"\",OFFSET(Data!F31,0,(View!$B$27-1)*12),IF($M28<>\"\",#N/A,\"\"))","v":74.747029999999995},{"$f":"IF(OFFSET(Data!G31,0,(View!$B$27-1)*12)<>\"\",OFFSET(Data!G31,0,(View!$B$27-1)*12),IF($N28<>\"\",#N/A,\"\"))","v":68.503069999999994},"OK",{"$f":"IF(OFFSET(Data!I31,0,(View!$B$27-1)*12)<>\"\",OFFSET(Data!I31,0,(View!$B$27-1)*12),IF($M28<>\"\",#N/A,\"\"))","v":74.892700000000005},{"$f":"IF(OFFSET(Data!J31,0,(View!$B$27-1)*12)<>\"\",OFFSET(Data!J31,0,(View!$B$27-1)*12),IF($N28<>\"\",#N/A,\"\"))","v":69.130330000000001},"OK"]
[null,null,null,null,null,null,null,null,null,null,{"$f":"IF(OFFSET(Data!A32,0,(View!$B$27-1)*12)<>\"\",$B$3 + OFFSET(Data!A32,0,(View!$B$27-1)*12),\"\")","v":44474.391469907408},{"$f":"IF(OFFSET(Data!B32,0,(View!$B$27-1)*12)<>\"\",OFFSET(Data!B32,0,(View!$B$27-1)*12),\"\")","v":28},{"$f":"IF(OFFSET(Data!C32,0,(View!$B$27-1)*12)<>\"\",OFFSET(Data!C32,0,(View!$B$27-1)*12),\"\")","v":72.066429999999997},{"$f":"IF(OFFSET(Data!D32,0,(View!$B$27-1)*12)<>\"\",OFFSET(Data!D32,0,(View!$B$27-1)*12),\"\")","v":66.608670000000004},4580016.0507553965,"OK",{"$f":"IF(OFFSET(Data!F32,0,(View!$B$27-1)*12)<>\"\",OFFSET(Data!F32,0,(View!$B$27-1)*12),IF($M29<>\"\",#N/A,\"\"))","v":74.666470000000004},{"$f":"IF(OFFSET(Data!G32,0,(View!$B$27-1)*12)<>\"\",OFFSET(Data!G32,0,(View!$B$27-1)*12),IF($N29<>\"\",#N/A,\"\"))","v":71.607579999999999},"OK",{"$f":"IF(OFFSET(Data!I32,0,(View!$B$27-1)*12)<>\"\",OFFSET(Data!I32,0,(View!$B$27-1)*12),IF($M29<>\"\",#N/A,\"\"))","v":74.812970000000007},{"$f":"IF(OFFSET(Data!J32,0,(View!$B$27-1)*12)<>\"\",OFFSET(Data!J32,0,(View!$B$27-1)*12),IF($N29<>\"\",#N/A,\"\"))","v":71.800120000000007},"OK"]
[null,null,null,null,null,null,null,null,null,null,{"$f":"IF(OFFSET(Data!A33,0,(View!$B$27-1)*12)<>\"\",$B$3 + OFFSET(Data!A33,0,(View!$B$27-1)*12),\"\")","v":44474.391481481478},{"$f":"IF(OFFSET(Data!B33,0,(View!$B$27-1)*12)<>\"\",OFFSET(Data!B33,0,(View!$B$27-1)*12),\"\")","v":29},{"$f":"IF(OFFSET(Data!C33,0,(View!$B$27-1)*12)<>\"\",OFFSET(Data!C33,0,(View!$B$27-1)*12),\"\")","v":72.053690000000003},{"$f":"IF(OFFSET(Data!D33,0,(View!$B$27-1)*12)<>\"\",OFFSET(Data!D33,0,(View!$B$27-1)*12),\"\")","v":71.680869999999999},14726074.728360618,"OK",{"$f":"IF(OFFSET(Data!F33,0,(View!$B$27-1)*12)<>\"\",OFFSET(Data!F33,0,(View!$B$27-1)*12),IF($M30<>\"\",#N/A,\"\"))","v":74.656890000000004},{"$f":"IF(OFFSET(Data!G33,0,(View!$B$27-1)*12)<>\"\",OFFSET(Data!G33,0,(View!$B$27-1)*12),IF($N30<>\"\",#N/A,\"\"))","v":74.379810000000006},"OK",{"$f":"IF(OFFSET(Data!I33,0,(View!$B$27-1)*12)<>\"\",OFFSET(Data!I33,0,(View!$B$27-1)*12),IF($M30<>\"\",#N/A,\"\"))","v":74.804389999999998},{"$f":"IF(OFFSET(Data!J33,0,(View!$B$27-1)*12)<>\"\",OFFSET(Data!J33,0,(View!$B$27-1)*12),IF($N30<>\"\",#N/A,\"\"))","v":74.557169999999999},"OK"]
[null,null,null,null,null,null,null,null,null,null,{"$f":"IF(OFFSET(Data!A34,0,(View!$B$27-1)*12)<>\"\",$B$3 + OFFSET(Data!A34,0,(View!$B$27-1)*12),\"\")","v":44474.391493055555},{"$f":"IF(OFFSET(Data!B34,0,(View!$B$27-1)*12)<>\"\",OFFSET(Data!B34,0,(View!$B$27-1)*12),\"\")","v":30},{"$f":"IF(OFFSET(Data!C34,0,(View!$B$27-1)*12)<>\"\",OFFSET(Data!C34,0,(View!$B$27-1)*12),\"\")","v":71.957509999999999},{"$f":"IF(OFFSET(Data!D34,0,(View!$B$27-1)*12)<>\"\",OFFSET(Data!D34,0,(View!$B$27-1)*12),\"\")","v":67.405910000000006},5502892.1341563817,"OK",{"$f":"IF(OFFSET(Data!F34,0,(View!$B$27-1)*12)<>\"\",OFFSET(Data!F34,0,(View!$B$27-1)*12),IF($M31<>\"\",#N/A,\"\"))","v":74.59742},{"$f":"IF(OFFSET(Data!G34,0,(View!$B$27-1)*12)<>\"\",OFFSET(Data!G34,0,(View!$B$27-1)*12),IF($N31<>\"\",#N/A,\"\"))","v":72.379909999999995},"OK",{"$f":"IF(OFFSET(Data!I34,0,(View!$B$27-1)*12)<>\"\",OFFSET(Data!I34,0,(View!$B$27-1)*12),IF($M31<>\"\",#N/A,\"\"))","v":74.782780000000002},{"$f":"IF(OFFSET(Data!J34,0,(View!$B$27-1)*12)<>\"\",OFFSET(Data!J34,0,(View!$B$27-1)*12),IF($N31<>\"\",#N/A,\"\"))","v":74.104230000000001},"OK"]
[null,null,null,null,null,null,null,null,null,null,{"$f":"IF(OFFSET(Data!A35,0,(View!$B$27-1)*12)<>\"\",$B$3 + OFFSET(Data!A35,0,(View!$B$27-1)*12),\"\")","v":44474.391504629632},{"$f":"IF(OFFSET(Data!B35,0,(View!$B$27-1)*12)<>\"\",OFFSET(Data!B35,0,(View!$B$27-1)*12),\"\")","v":31},{"$f":"IF(OFFSET(Data!C35,0,(View!$B$27-1)*12)<>\"\",OFFSET(Data!C35,0,(View!$B$27-1)*12),\"\")","v":71.939729999999997},{"$f":"IF(OFFSET(Data!D35,0,(View!$B$27-1)*12)<>\"\",OFFSET(Data!D35,0,(View!$B$27-1)*12),\"\")","v":71.369129999999998},13706071.719128506,"OK",{"$f":"IF(OFFSET(Data!F35,0,(View!$B$27-1)*12)<>\"\",OFFSET(Data!F35,0,(View!$B$27-1)*12),IF($M32<>\"\",#N/A,\"\"))","v":74.602559999999997},{"$f":"IF(OFFSET(Data!G35,0,(View!$B$27-1)*12)<>\"\",OFFSET(Data!G35,0,(View!$B$27-1)*12),IF($N32<>\"\",#N/A,\"\"))","v":74.754140000000007},"OK",{"$f":"IF(OFFSET(Data!I35,0,(View!$B$27-1)*12)<>\"\",OFFSET(Data!I35,0,(View!$B$27-1)*12),IF($M32<>\"\",#N/A,\"\"))","v":74.787959999999998},{"$f":"IF(OFFSET(Data!J35,0,(View!$B$27-1)*12)<>\"\",OFFSET(Data!J35,0,(View!$B$27-1)*12),IF($N32<>\"\",#N/A,\"\"))","v":74.940259999999995},"OK"]
[null,null,null,null,null,null,null,null,null,null,{"$f":"IF(OFFSET(Data!A36,0,(View!$B$27-1)*12)<>\"\",$B$3 + OFFSET(Data!A36,0,(View!$B$27-1)*12),\"\")","v":44474.391516203701},{"$f":"IF(OFFSET(Data!B36,0,(View!$B$27-1)*12)<>\"\",OFFSET(Data!B36,0,(View!$B$27-1)*12),\"\")","v":32},{"$f":"IF(OFFSET(Data!C36,0,(View!$B$27-1)*12)<>\"\",OFFSET(Data!C36,0,(View!$B$27-1)*12),\"\")","v":71.868459999999999},{"$f":"IF(OFFSET(Data!D36,0,(View!$B$27-1)*12)<>\"\",OFFSET(Data!D36,0,(View!$B$27-1)*12),\"\")","v":68.744540000000001},7489520.2612397932,"OK",{"$f":"IF(OFFSET(Data!F36,0,(View!$B$27-1)*12)<>\"\",OFFSET(Data!F36,0,(View!$B$27-1)*12),IF($M33<>\"\",#N/A,\"\"))","v":74.536900000000003},{"$f":"IF(OFFSET(Data!G36,0,(View!$B$27-1)*12)<>\"\",OFFSET(Data!G36,0,(View!$B$27-1)*12),IF($N33<>\"\",#N/A,\"\"))","v":71.761020000000002},"OK",{"$f":"IF(OFFSET(Data!I36,0,(View!$B$27-1)*12)<>\"\",OFFSET(Data!I36,0,(View!$B$27-1)*12),IF($M33<>\"\",#N/A,\"\"))","v":74.722570000000005},{"$f":"IF(OFFSET(Data!J36,0,(View!$B$27-1)*12)<>\"\",OFFSET(Data!J36,0,(View!$B$27-1)*12),IF($N33<>\"\",#N/A,\"\"))","v":71.963419999999999},"OK"]
[null,null,null,null,null,null,null,null,null,null,{"$f":"IF(OFFSET(Data!A37,0,(View!$B$27-1)*12)<>\"\",$B$3 + OFFSET(Data!A37,0,(View!$B$27-1)*12),\"\")","v":44474.391527777778},{"$f":"IF(OFFSET(Data!B37,0,(View!$B$27-1)*12)<>\"\",OFFSET(Data!B37,0,(View!$B$27-1)*12),\"\")","v":33},{"$f":"IF(OFFSET(Data!C37,0,(View!$B$27-1)*12)<>\"\",OFFSET(Data!C37,0,(View!$B$27-1)*12),\"\")","v":72.146060000000006},{"$f":"IF(OFFSET(Data!D37,0,(View!$B$27-1)*12)<>\"\",OFFSET(Data!D37,0,(View!$B$27-1)*12),\"\")","v":76.890299999999996},48868611.541786276,"OK",{"$f":"IF(OFFSET(Data!F37,0,(View!$B$27-1)*12)<>\"\",OFFSET(Data!F37,0,(View!$B$27-1)*12),IF($M34<>\"\",#N/A,\"\"))","v":74.813720000000004},{"$f":"IF(OFFSET(Data!G37,0,(View!$B$27-1)*12)<>\"\",OFFSET(Data!G37,0,(View!$B$27-1)*12),IF($N34<>\"\",#N/A,\"\"))","v":79.550129999999996},"OK",{"$f":"IF(OFFSET(Data!I37,0,(View!$B$27-1)*12)<>\"\",OFFSET(Data!I37,0,(View!$B$27-1)*12),IF($M34<>\"\",#N/A,\"\"))","v":74.988759999999999},{"$f":"IF(OFFSET(Data!J37,0,(View!$B$27-1)*12)<>\"\",OFFSET(Data!J37,0,(View!$B$27-1)*12),IF($N34<>\"\",#N/A,\"\"))","v":79.616420000000005},"OK"]
[null,null,null,null,null,null,null,null,null,null,{"$f":"IF(OFFSET(Data!A38,0,(View!$B$27-1)*12)<>\"\",$B$3 + OFFSET(Data!A38,0,(View!$B$27-1)*12),\"\")","v":44474.391539351855},{"$f":"IF(OFFSET(Data!B38,0,(View!$B$27-1)*12)<>\"\",OFFSET(Data!B38,0,(View!$B$27-1)*12),\"\")","v":34},{"$f":"IF(OFFSET(Data!C38,0,(View!$B$27-1)*12)<>\"\",OFFSET(Data!C38,0,(View!$B$27-1)*12),\"\")","v":72.465140000000005},{"$f":"IF(OFFSET(Data!D38,0,(View!$B$27-1)*12)<>\"\",OFFSET(Data!D38,0,(View!$B$27-1)*12),\"\")","v":77.699529999999996},58877993.326042414,"OK",{"$f":"IF(OFFSET(Data!F38,0,(View!$B$27-1)*12)<>\"\",OFFSET(Data!F38,0,(View!$B$27-1)*12),IF($M35<>\"\",#N/A,\"\"))","v":75.234889999999993},{"$f":"IF(OFFSET(Data!G38,0,(View!$B$27-1)*12)<>\"\",OFFSET(Data!G38,0,(View!$B$27-1)*12),IF($N35<>\"\",#N/A,\"\"))","v":81.309470000000005},"OK",{"$f":"IF(OFFSET(Data!I38,0,(View!$B$27-1)*12)<>\"\",OFFSET(Data!I38,0,(View!$B$27-1)*12),IF($M35<>\"\",#N/A,\"\"))","v":75.393209999999996},{"$f":"IF(OFFSET(Data!J38,0,(View!$B$27-1)*12)<>\"\",OFFSET(Data!J38,0,(View!$B$27-1)*12),IF($N35<>\"\",#N/A,\"\"))","v":81.34205},"OK"]
[null,null,null,null,null,null,null,null,null,null,{"$f":"IF(OFFSET(Data!A39,0,(View!$B$27-1)*12)<>\"\",$B$3 + OFFSET(Data!A39,0,(View!$B$27-1)*12),\"\")","v":44474.391550925924},{"$f":"IF(OFFSET(Data!B39,0,(View!$B$27-1)*12)<>\"\",OFFSET(Data!B39,0,(View!$B$27-1)*12),\"\")","v":35},{"$f":"IF(OFFSET(Data!C39,0,(View!$B$27-1)*12)<>\"\",OFFSET(Data!C39,0,(View!$B$27-1)*12),\"\")","v":73.153350000000003},{"$f":"IF(OFFSET(Data!D39,0,(View!$B$27-1)*12)<>\"\",OFFSET(Data!D39,0,(View!$B$27-1)*12),\"\")","v":80.922280000000001},123659646.3099454,"OK",{"$f":"IF(OFFSET(Data!F39,0,(View!$B$27-1)*12)<>\"\",OFFSET(Data!F39,0,(View!$B$27-1)*12),IF($M36<>\"\",#N/A,\"\"))","v":75.847260000000006},{"$f":"IF(OFFSET(Data!G39,0,(View!$B$27-1)*12)<>\"\",OFFSET(Data!G39,0,(View!$B$27-1)*12),IF($N36<>\"\",#N/A,\"\"))","v":83.22824},"OK",{"$f":"IF(OFFSET(Data!I39,0,(View!$B$27-1)*12)<>\"\",OFFSET(Data!I39,0,(View!$B$27-1)*12),IF($M36<>\"\",#N/A,\"\"))","v":76.037369999999996},{"$f":"IF(OFFSET(Data!J39,0,(View!$B$27-1)*12)<>\"\",OFFSET(Data!J39,0,(View!$B$27-1)*12),IF($N36<>\"\",#N/A,\"\"))","v":83.586070000000007},"OK"]
[null,null,null,null,null,null,null,null,null,null,{"$f":"IF(OFFSET(Data!A40,0,(View!$B$27-1)*12)<>\"\",$B$3 + OFFSET(Data!A40,0,(View!$B$27-1)*12),\"\")","v":44474.391562500001},{"$f":"IF(OFFSET(Data!B40,0,(View!$B$27-1)*12)<>\"\",OFFSET(Data!B40,0,(View!$B$27-1)*12),\"\")","v":36},{"$f":"IF(OFFSET(Data!C40,0,(View!$B$27-1)*12)<>\"\",OFFSET(Data!C40,0,(View!$B$27-1)*12),\"\")","v":73.471109999999996},{"$f":"IF(OFFSET(Data!D40,0,(View!$B$27-1)*12)<>\"\",OFFSET(Data!D40,0,(View!$B$27-1)*12),\"\")","v":78.873630000000006},77154808.913947612,"OK",{"$f":"IF(OFFSET(Data!F40,0,(View!$B$27-1)*12)<>\"\",OFFSET(Data!F40,0,(View!$B$27-1)*12),IF($M37<>\"\",#N/A,\"\"))","v":76.081890000000001},{"$f":"IF(OFFSET(Data!G40,0,(View!$B$27-1)*12)<>\"\",OFFSET(Data!G40,0,(View!$B$27-1)*12),IF($N37<>\"\",#N/A,\"\"))","v":80.616330000000005},"OK",{"$f":"IF(OFFSET(Data!I40,0,(View!$B$27-1)*12)<>\"\",OFFSET(Data!I40,0,(View!$B$27-1)*12),IF($M37<>\"\",#N/A,\"\"))","v":76.290649999999999},{"$f":"IF(OFFSET(Data!J40,0,(View!$B$27-1)*12)<>\"\",OFFSET(Data!J40,0,(View!$B$27-1)*12),IF($N37<>\"\",#N/A,\"\"))","v":81.036900000000003},"OK"]
[null,null,null,null,null,null,null,null,null,null,{"$f":"IF(OFFSET(Data!A41,0,(View!$B$27-1)*12)<>\"\",$B$3 + OFFSET(Data!A41,0,(View!$B$27-1)*12),\"\")","v":44474.391574074078},{"$f":"IF(OFFSET(Data!B41,0,(View!$B$27-1)*12)<>\"\",OFFSET(Data!B41,0,(View!$B$27-1)*12),\"\")","v":37},{"$f":"IF(OFFSET(Data!C41,0,(View!$B$27-1)*12)<>\"\",OFFSET(Data!C41,0,(View!$B$27-1)*12),\"\")","v":73.599699999999999},{"$f":"IF(OFFSET(Data!D41,0,(View!$B$27-1)*12)<>\"\",OFFSET(Data!D41,0,(View!$B$27-1)*12),\"\")","v":76.717879999999994},46966478.66933006,"OK",{"$f":"IF(OFFSET(Data!F41,0,(View!$B$27-1)*12)<>\"\",OFFSET(Data!F41,0,(View!$B$27-1)*12),IF($M38<>\"\",#N/A,\"\"))","v":76.152760000000001},{"$f":"IF(OFFSET(Data!G41,0,(View!$B$27-1)*12)<>\"\",OFFSET(Data!G41,0,(View!$B$27-1)*12),IF($N38<>\"\",#N/A,\"\"))","v":78.146529999999998},"OK",{"$f":"IF(OFFSET(Data!I41,0,(View!$B$27-1)*12)<>\"\",OFFSET(Data!I41,0,(View!$B$27-1)*12),IF($M38<>\"\",#N/A,\"\"))","v":76.388580000000005},{"$f":"IF(OFFSET(Data!J41,0,(View!$B$27-1)*12)<>\"\",OFFSET(Data!J41,0,(View!$B$27-1)*12),IF($N38<>\"\",#N/A,\"\"))","v":78.947770000000006},"OK"]
[null,null,null,null,null,null,null,null,null,null,{"$f":"IF(OFFSET(Data!A42,0,(View!$B$27-1)*12)<>\"\",$B$3 + OFFSET(Data!A42,0,(View!$B$27-1)*12),\"\")","v":44474.391585648147},{"$f":"IF(OFFSET(Data!B42,0,(View!$B$27-1)*12)<>\"\",OFFSET(Data!B42,0,(View!$B$27-1)*12),\"\")","v":38},{"$f":"IF(OFFSET(Data!C42,0,(View!$B$27-1)*12)<>\"\",OFFSET(Data!C42,0,(View!$B$27-1)*12),\"\")","v":73.728359999999995},{"$f":"IF(OFFSET(Data!D42,0,(View!$B$27-1)*12)<>\"\",OFFSET(Data!D42,0,(View!$B$27-1)*12),\"\")","v":76.908940000000001},49078807.291491546,"OK",{"$f":"IF(OFFSET(Data!F42,0,(View!$B$27-1)*12)<>\"\",OFFSET(Data!F42,0,(View!$B$27-1)*12),IF($M39<>\"\",#N/A,\"\"))","v":76.2179},{"$f":"IF(OFFSET(Data!G42,0,(View!$B$27-1)*12)<>\"\",OFFSET(Data!G42,0,(View!$B$27-1)*12),IF($N39<>\"\",#N/A,\"\"))","v":78.123530000000002},"OK",{"$f":"IF(OFFSET(Data!I42,0,(View!$B$27-1)*12)<>\"\",OFFSET(Data!I42,0,(View!$B$27-1)*12),IF($M39<>\"\",#N/A,\"\"))","v":76.475470000000001},{"$f":"IF(OFFSET(Data!J42,0,(View!$B$27-1)*12)<>\"\",OFFSET(Data!J42,0,(View!$B$27-1)*12),IF($N39<>\"\",#N/A,\"\"))","v":78.863259999999997},"OK"]
[null,null,null,null,null,null,null,null,null,null,{"$f":"IF(OFFSET(Data!A43,0,(View!$B$27-1)*12)<>\"\",$B$3 + OFFSET(Data!A43,0,(View!$B$27-1)*12),\"\")","v":44474.391597222224},{"$f":"IF(OFFSET(Data!B43,0,(View!$B$27-1)*12)<>\"\",OFFSET(Data!B43,0,(View!$B$27-1)*12),\"\")","v":39},{"$f":"IF(OFFSET(Data!C43,0,(View!$B$27-1)*12)<>\"\",OFFSET(Data!C43,0,(View!$B$27-1)*12),\"\")","v":73.849620000000002},{"$f":"IF(OFFSET(Data!D43,0,(View!$B$27-1)*12)<>\"\",OFFSET(Data!D43,0,(View!$B$27-1)*12),\"\")","v":76.959639999999993},49655115.909763604,"OK",{"$f":"IF(OFFSET(Data!F43,0,(View!$B$27-1)*12)<>\"\",OFFSET(Data!F43,0,(View!$B$27-1)*12),IF($M40<>\"\",#N/A,\"\"))","v":76.284589999999994},{"$f":"IF(OFFSET(Data!G43,0,(View!$B$27-1)*12)<>\"\",OFFSET(Data!G43,0,(View!$B$27-1)*12),IF($N40<>\"\",#N/A,\"\"))","v":78.268709999999999},"OK",{"$f":"IF(OFFSET(Data!I43,0,(View!$B$27-1)*12)<>\"\",OFFSET(Data!I43,0,(View!$B$27-1)*12),IF($M40<>\"\",#N/A,\"\"))","v":76.562979999999996},{"$f":"IF(OFFSET(Data!J43,0,(View!$B$27-1)*12)<>\"\",OFFSET(Data!J43,0,(View!$B$27-1)*12),IF($N40<>\"\",#N/A,\"\"))","v":79.013369999999995},"OK"]
[null,null,null,null,null,null,null,null,null,null,{"$f":"IF(OFFSET(Data!A44,0,(View!$B$27-1)*12)<>\"\",$B$3 + OFFSET(Data!A44,0,(View!$B$27-1)*12),\"\")","v":44474.391608796293},{"$f":"IF(OFFSET(Data!B44,0,(View!$B$27-1)*12)<>\"\",OFFSET(Data!B44,0,(View!$B$27-1)*12),\"\")","v":40},{"$f":"IF(OFFSET(Data!C44,0,(View!$B$27-1)*12)<>\"\",OFFSET(Data!C44,0,(View!$B$27-1)*12),\"\")","v":73.957520000000002},{"$f":"IF(OFFSET(Data!D44,0,(View!$B$27-1)*12)<>\"\",OFFSET(Data!D44,0,(View!$B$27-1)*12),\"\")","v":76.873320000000007},48677918.58566761,"OK",{"$f":"IF(OFFSET(Data!F44,0,(View!$B$27-1)*12)<>\"\",OFFSET(Data!F44,0,(View!$B$27-1)*12),IF($M41<>\"\",#N/A,\"\"))","v":76.339020000000005},{"$f":"IF(OFFSET(Data!G44,0,(View!$B$27-1)*12)<>\"\",OFFSET(Data!G44,0,(View!$B$27-1)*12),IF($N41<>\"\",#N/A,\"\"))","v":78.058430000000001},"OK",{"$f":"IF(OFFSET(Data!I44,0,(View!$B$27-1)*12)<>\"\",OFFSET(Data!I44,0,(View!$B$27-1)*12),IF($M41<>\"\",#N/A,\"\"))","v":76.636880000000005},{"$f":"IF(OFFSET(Data!J44,0,(View!$B$27-1)*12)<>\"\",OFFSET(Data!J44,0,(View!$B$27-1)*12),IF($N41<>\"\",#N/A,\"\"))","v":78.832599999999999},"OK"]
[null,null,null,null,null,null,null,null,null,null,{"$f":"IF(OFFSET(Data!A45,0,(View!$B$27-1)*12)<>\"\",$B$3 + OFFSET(Data!A45,0,(View!$B$27-1)*12),\"\")","v":44474.39162037037},{"$f":"IF(OFFSET(Data!B45,0,(View!$B$27-1)*12)<>\"\",OFFSET(Data!B45,0,(View!$B$27-1)*12),\"\")","v":41},{"$f":"IF(OFFSET(Data!C45,0,(View!$B$27-1)*12)<>\"\",OFFSET(Data!C45,0,(View!$B$27-1)*12),\"\")","v":74.060329999999993},{"$f":"IF(OFFSET(Data!D45,0,(View!$B$27-1)*12)<>\"\",OFFSET(Data!D45,0,(View!$B$27-1)*12),\"\")","v":76.928979999999996},49305798.894161612,"OK",{"$f":"IF(OFFSET(Data!F45,0,(View!$B$27-1)*12)<>\"\",OFFSET(Data!F45,0,(View!$B$27-1)*12),IF($M42<>\"\",#N/A,\"\"))","v":76.394800000000004},{"$f":"IF(OFFSET(Data!G45,0,(View!$B$27-1)*12)<>\"\",OFFSET(Data!G45,0,(View!$B$27-1)*12),IF($N42<>\"\",#N/A,\"\"))","v":78.185839999999999},"OK",{"$f":"IF(OFFSET(Data!I45,0,(View!$B$27-1)*12)<>\"\",OFFSET(Data!I45,0,(View!$B$27-1)*12),IF($M42<>\"\",#N/A,\"\"))","v":76.709549999999993},{"$f":"IF(OFFSET(Data!J45,0,(View!$B$27-1)*12)<>\"\",OFFSET(Data!J45,0,(View!$B$27-1)*12),IF($N42<>\"\",#N/A,\"\"))","v":78.920540000000003},"OK"]
[null,null,null,null,null,null,null,null,null,null,{"$f":"IF(OFFSET(Data!A46,0,(View!$B$27-1)*12)<>\"\",$B$3 + OFFSET(Data!A46,0,(View!$B$27-1)*12),\"\")","v":44474.391631944447},{"$f":"IF(OFFSET(Data!B46,0,(View!$B$27-1)*12)<>\"\",OFFSET(Data!B46,0,(View!$B$27-1)*12),\"\")","v":42},{"$f":"IF(OFFSET(Data!C46,0,(View!$B$27-1)*12)<>\"\",OFFSET(Data!C46,0,(View!$B$27-1)*12),\"\")","v":74.150509999999997},{"$f":"IF(OFFSET(Data!D46,0,(View!$B$27-1)*12)<>\"\",OFFSET(Data!D46,0,(View!$B$27-1)*12),\"\")","v":76.804630000000003},47914063.047259517,"OK",{"$f":"IF(OFFSET(Data!F46,0,(View!$B$27-1)*12)<>\"\",OFFSET(Data!F46,0,(View!$B$27-1)*12),IF($M43<>\"\",#N/A,\"\"))","v":76.44171},{"$f":"IF(OFFSET(Data!G46,0,(View!$B$27-1)*12)<>\"\",OFFSET(Data!G46,0,(View!$B$27-1)*12),IF($N43<>\"\",#N/A,\"\"))","v":78.026790000000005},"OK",{"$f":"IF(OFFSET(Data!I46,0,(View!$B$27-1)*12)<>\"\",OFFSET(Data!I46,0,(View!$B$27-1)*12),IF($M43<>\"\",#N/A,\"\"))","v":76.771969999999996},{"$f":"IF(OFFSET(Data!J46,0,(View!$B$27-1)*12)<>\"\",OFFSET(Data!J46,0,(View!$B$27-1)*12),IF($N43<>\"\",#N/A,\"\"))","v":78.772189999999995},"OK"]
[null,null,null,null,null,null,null,null,null,null,{"$f":"IF(OFFSET(Data!A47,0,(View!$B$27-1)*12)<>\"\",$B$3 + OFFSET(Data!A47,0,(View!$B$27-1)*12),\"\")","v":44474.391643518517},{"$f":"IF(OFFSET(Data!B47,0,(View!$B$27-1)*12)<>\"\",OFFSET(Data!B47,0,(View!$B$27-1)*12),\"\")","v":43},{"$f":"IF(OFFSET(Data!C47,0,(View!$B$27-1)*12)<>\"\",OFFSET(Data!C47,0,(View!$B$27-1)*12),\"\")","v":74.236919999999998},{"$f":"IF(OFFSET(Data!D47,0,(View!$B$27-1)*12)<>\"\",OFFSET(Data!D47,0,(View!$B$27-1)*12),\"\")","v":76.855260000000001},48475913.293365933,"OK",{"$f":"IF(OFFSET(Data!F47,0,(View!$B$27-1)*12)<>\"\",OFFSET(Data!F47,0,(View!$B$27-1)*12),IF($M44<>\"\",#N/A,\"\"))","v":76.487769999999998},{"$f":"IF(OFFSET(Data!G47,0,(View!$B$27-1)*12)<>\"\",OFFSET(Data!G47,0,(View!$B$27-1)*12),IF($N44<>\"\",#N/A,\"\"))","v":78.080759999999998},"OK",{"$f":"IF(OFFSET(Data!I47,0,(View!$B$27-1)*12)<>\"\",OFFSET(Data!I47,0,(View!$B$27-1)*12),IF($M44<>\"\",#N/A,\"\"))","v":76.831770000000006},{"$f":"IF(OFFSET(Data!J47,0,(View!$B$27-1)*12)<>\"\",OFFSET(Data!J47,0,(View!$B$27-1)*12),IF($N44<>\"\",#N/A,\"\"))","v":78.803120000000007},"OK"]
[null,null,null,null,null,null,null,null,null,null,{"$f":"IF(OFFSET(Data!A48,0,(View!$B$27-1)*12)<>\"\",$B$3 + OFFSET(Data!A48,0,(View!$B$27-1)*12),\"\")","v":44474.391655092593},{"$f":"IF(OFFSET(Data!B48,0,(View!$B$27-1)*12)<>\"\",OFFSET(Data!B48,0,(View!$B$27-1)*12),\"\")","v":44},{"$f":"IF(OFFSET(Data!C48,0,(View!$B$27-1)*12)<>\"\",OFFSET(Data!C48,0,(View!$B$27-1)*12),\"\")","v":74.317509999999999},{"$f":"IF(OFFSET(Data!D48,0,(View!$B$27-1)*12)<>\"\",OFFSET(Data!D48,0,(View!$B$27-1)*12),\"\")","v":76.847499999999997},48389373.576946586,"OK",{"$f":"IF(OFFSET(Data!F48,0,(View!$B$27-1)*12)<>\"\",OFFSET(Data!F48,0,(View!$B$27-1)*12),IF($M45<>\"\",#N/A,\"\"))","v":76.526529999999994},{"$f":"IF(OFFSET(Data!G48,0,(View!$B$27-1)*12)<>\"\",OFFSET(Data!G48,0,(View!$B$27-1)*12),IF($N45<>\"\",#N/A,\"\"))","v":77.931629999999998},"OK",{"$f":"IF(OFFSET(Data!I48,0,(View!$B$27-1)*12)<>\"\",OFFSET(Data!I48,0,(View!$B$27-1)*12),IF($M45<>\"\",#N/A,\"\"))","v":76.883459999999999},{"$f":"IF(OFFSET(Data!J48,0,(View!$B$27-1)*12)<>\"\",OFFSET(Data!J48,0,(View!$B$27-1)*12),IF($N45<>\"\",#N/A,\"\"))","v":78.669579999999996},"OK"]
[null,null,null,null,null,null,null,null,null,null,{"$f":"IF(OFFSET(Data!A49,0,(View!$B$27-1)*12)<>\"\",$B$3 + OFFSET(Data!A49,0,(View!$B$27-1)*12),\"\")","v":44474.39166666667},{"$f":"IF(OFFSET(Data!B49,0,(View!$B$27-1)*12)<>\"\",OFFSET(Data!B49,0,(View!$B$27-1)*12),\"\")","v":45},{"$f":"IF(OFFSET(Data!C49,0,(View!$B$27-1)*12)<>\"\",OFFSET(Data!C49,0,(View!$B$27-1)*12),\"\")","v":74.385909999999996},{"$f":"IF(OFFSET(Data!D49,0,(View!$B$27-1)*12)<>\"\",OFFSET(Data!D49,0,(View!$B$27-1)*12),\"\")","v":76.658550000000005},46329221.229871452,"OK",{"$f":"IF(OFFSET(Data!F49,0,(View!$B$27-1)*12)<>\"\",OFFSET(Data!F49,0,(View!$B$27-1)*12),IF($M46<>\"\",#N/A,\"\"))","v":76.563879999999997},{"$f":"IF(OFFSET(Data!G49,0,(View!$B$27-1)*12)<>\"\",OFFSET(Data!G49,0,(View!$B$27-1)*12),IF($N46<>\"\",#N/A,\"\"))","v":77.952610000000007},"OK",{"$f":"IF(OFFSET(Data!I49,0,(View!$B$27-1)*12)<>\"\",OFFSET(Data!I49,0,(View!$B$27-1)*12),IF($M46<>\"\",#N/A,\"\"))","v":76.932400000000001},{"$f":"IF(OFFSET(Data!J49,0,(View!$B$27-1)*12)<>\"\",OFFSET(Data!J49,0,(View!$B$27-1)*12),IF($N46<>\"\",#N/A,\"\"))","v":78.672970000000007},"OK"]
[null,null,null,null,null,null,null,null,null,null,{"$f":"IF(OFFSET(Data!A50,0,(View!$B$27-1)*12)<>\"\",$B$3 + OFFSET(Data!A50,0,(View!$B$27-1)*12),\"\")","v":44474.39167824074},{"$f":"IF(OFFSET(Data!B50,0,(View!$B$27-1)*12)<>\"\",OFFSET(Data!B50,0,(View!$B$27-1)*12),\"\")","v":46},{"$f":"IF(OFFSET(Data!C50,0,(View!$B$27-1)*12)<>\"\",OFFSET(Data!C50,0,(View!$B$27-1)*12),\"\")","v":74.445989999999995},{"$f":"IF(OFFSET(Data!D50,0,(View!$B$27-1)*12)<>\"\",OFFSET(Data!D50,0,(View!$B$27-1)*12),\"\")","v":76.536349999999999},45043797.771741748,"OK",{"$f":"IF(OFFSET(Data!F50,0,(View!$B$27-1)*12)<>\"\",OFFSET(Data!F50,0,(View!$B$27-1)*12),IF($M47<>\"\",#N/A,\"\"))","v":76.590710000000001},{"$f":"IF(OFFSET(Data!G50,0,(View!$B$27-1)*12)<>\"\",OFFSET(Data!G50,0,(View!$B$27-1)*12),IF($N47<>\"\",#N/A,\"\"))","v":77.652959999999993},"OK",{"$f":"IF(OFFSET(Data!I50,0,(View!$B$27-1)*12)<>\"\",OFFSET(Data!I50,0,(View!$B$27-1)*12),IF($M47<>\"\",#N/A,\"\"))","v":76.970190000000002},{"$f":"IF(OFFSET(Data!J50,0,(View!$B$27-1)*12)<>\"\",OFFSET(Data!J50,0,(View!$B$27-1)*12),IF($N47<>\"\",#N/A,\"\"))","v":78.399990000000003},"OK"]
[null,null,null,null,null,null,null,null,null,null,{"$f":"IF(OFFSET(Data!A51,0,(View!$B$27-1)*12)<>\"\",$B$3 + OFFSET(Data!A51,0,(View!$B$27-1)*12),\"\")","v":44474.391689814816},{"$f":"IF(OFFSET(Data!B51,0,(View!$B$27-1)*12)<>\"\",OFFSET(Data!B51,0,(View!$B$27-1)*12),\"\")","v":47},{"$f":"IF(OFFSET(Data!C51,0,(View!$B$27-1)*12)<>\"\",OFFSET(Data!C51,0,(View!$B$27-1)*12),\"\")","v":74.500159999999994},{"$f":"IF(OFFSET(Data!D51,0,(View!$B$27-1)*12)<>\"\",OFFSET(Data!D51,0,(View!$B$27-1)*12),\"\")","v":76.459819999999993},44257002.898977064,"OK",{"$f":"IF(OFFSET(Data!F51,0,(View!$B$27-1)*12)<>\"\",OFFSET(Data!F51,0,(View!$B$27-1)*12),IF($M48<>\"\",#N/A,\"\"))","v":76.61318},{"$f":"IF(OFFSET(Data!G51,0,(View!$B$27-1)*12)<>\"\",OFFSET(Data!G51,0,(View!$B$27-1)*12),IF($N48<>\"\",#N/A,\"\"))","v":77.538510000000002},"OK",{"$f":"IF(OFFSET(Data!I51,0,(View!$B$27-1)*12)<>\"\",OFFSET(Data!I51,0,(View!$B$27-1)*12),IF($M48<>\"\",#N/A,\"\"))","v":77.003460000000004},{"$f":"IF(OFFSET(Data!J51,0,(View!$B$27-1)*12)<>\"\",OFFSET(Data!J51,0,(View!$B$27-1)*12),IF($N48<>\"\",#N/A,\"\"))","v":78.310040000000001},"OK"]
[null,null,null,null,null,null,null,null,null,null,{"$f":"IF(OFFSET(Data!A52,0,(View!$B$27-1)*12)<>\"\",$B$3 + OFFSET(Data!A52,0,(View!$B$27-1)*12),\"\")","v":44474.391701388886},{"$f":"IF(OFFSET(Data!B52,0,(View!$B$27-1)*12)<>\"\",OFFSET(Data!B52,0,(View!$B$27-1)*12),\"\")","v":48},{"$f":"IF(OFFSET(Data!C52,0,(View!$B$27-1)*12)<>\"\",OFFSET(Data!C52,0,(View!$B$27-1)*12),\"\")","v":74.560509999999994},{"$f":"IF(OFFSET(Data!D52,0,(View!$B$27-1)*12)<>\"\",OFFSET(Data!D52,0,(View!$B$27-1)*12),\"\")","v":76.731449999999995},47113460.012914397,"OK",{"$f":"IF(OFFSET(Data!F52,0,(View!$B$27-1)*12)<>\"\",OFFSET(Data!F52,0,(View!$B$27-1)*12),IF($M49<>\"\",#N/A,\"\"))","v":76.644480000000001},{"$f":"IF(OFFSET(Data!G52,0,(View!$B$27-1)*12)<>\"\",OFFSET(Data!G52,0,(View!$B$27-1)*12),IF($N49<>\"\",#N/A,\"\"))","v":77.907359999999997},"OK",{"$f":"IF(OFFSET(Data!I52,0,(View!$B$27-1)*12)<>\"\",OFFSET(Data!I52,0,(View!$B$27-1)*12),IF($M49<>\"\",#N/A,\"\"))","v":77.044880000000006},{"$f":"IF(OFFSET(Data!J52,0,(View!$B$27-1)*12)<>\"\",OFFSET(Data!J52,0,(View!$B$27-1)*12),IF($N49<>\"\",#N/A,\"\"))","v":78.647069999999999},"OK"]
[null,null,null,null,null,null,null,null,null,null,{"$f":"IF(OFFSET(Data!A53,0,(View!$B$27-1)*12)<>\"\",$B$3 + OFFSET(Data!A53,0,(View!$B$27-1)*12),\"\")","v":44474.391712962963},{"$f":"IF(OFFSET(Data!B53,0,(View!$B$27-1)*12)<>\"\",OFFSET(Data!B53,0,(View!$B$27-1)*12),\"\")","v":49},{"$f":"IF(OFFSET(Data!C53,0,(View!$B$27-1)*12)<>\"\",OFFSET(Data!C53,0,(View!$B$27-1)*12),\"\")","v":74.616709999999998},{"$f":"IF(OFFSET(Data!D53,0,(View!$B$27-1)*12)<>\"\",OFFSET(Data!D53,0,(View!$B$27-1)*12),\"\")","v":76.704430000000002},46821249.569130547,"OK",{"$f":"IF(OFFSET(Data!F53,0,(View!$B$27-1)*12)<>\"\",OFFSET(Data!F53,0,(View!$B$27-1)*12),IF($M50<>\"\",#N/A,\"\"))","v":76.675079999999994},{"$f":"IF(OFFSET(Data!G53,0,(View!$B$27-1)*12)<>\"\",OFFSET(Data!G53,0,(View!$B$27-1)*12),IF($N50<>\"\",#N/A,\"\"))","v":77.93647},"OK",{"$f":"IF(OFFSET(Data!I53,0,(View!$B$27-1)*12)<>\"\",OFFSET(Data!I53,0,(View!$B$27-1)*12),IF($M50<>\"\",#N/A,\"\"))","v":77.085480000000004},{"$f":"IF(OFFSET(Data!J53,0,(View!$B$27-1)*12)<>\"\",OFFSET(Data!J53,0,(View!$B$27-1)*12),IF($N50<>\"\",#N/A,\"\"))","v":78.689089999999993},"OK"]
[null,null,null,null,null,null,null,null,null,null,{"$f":"IF(OFFSET(Data!A54,0,(View!$B$27-1)*12)<>\"\",$B$3 + OFFSET(Data!A54,0,(View!$B$27-1)*12),\"\")","v":44474.391724537039},{"$f":"IF(OFFSET(Data!B54,0,(View!$B$27-1)*12)<>\"\",OFFSET(Data!B54,0,(View!$B$27-1)*12),\"\")","v":50},{"$f":"IF(OFFSET(Data!C54,0,(View!$B$27-1)*12)<>\"\",OFFSET(Data!C54,0,(View!$B$27-1)*12),\"\")","v":74.667910000000006},{"$f":"IF(OFFSET(Data!D54,0,(View!$B$27-1)*12)<>\"\",OFFSET(Data!D54,0,(View!$B$27-1)*12),\"\")","v":76.638499999999993},46115826.862757504,"OK",{"$f":"IF(OFFSET(Data!F54,0,(View!$B$27-1)*12)<>\"\",OFFSET(Data!F54,0,(View!$B$27-1)*12),IF($M51<>\"\",#N/A,\"\"))","v":76.7042},{"$f":"IF(OFFSET(Data!G54,0,(View!$B$27-1)*12)<>\"\",OFFSET(Data!G54,0,(View!$B$27-1)*12),IF($N51<>\"\",#N/A,\"\"))","v":77.934539999999998},"OK",{"$f":"IF(OFFSET(Data!I54,0,(View!$B$27-1)*12)<>\"\",OFFSET(Data!I54,0,(View!$B$27-1)*12),IF($M51<>\"\",#N/A,\"\"))","v":77.123580000000004},{"$f":"IF(OFFSET(Data!J54,0,(View!$B$27-1)*12)<>\"\",OFFSET(Data!J54,0,(View!$B$27-1)*12),IF($N51<>\"\",#N/A,\"\"))","v":78.670990000000003},"OK"]
[null,null,null,null,null,null,null,null,null,null,{"$f":"IF(OFFSET(Data!A55,0,(View!$B$27-1)*12)<>\"\",$B$3 + OFFSET(Data!A55,0,(View!$B$27-1)*12),\"\")","v":44474.391736111109},{"$f":"IF(OFFSET(Data!B55,0,(View!$B$27-1)*12)<>\"\",OFFSET(Data!B55,0,(View!$B$27-1)*12),\"\")","v":51},{"$f":"IF(OFFSET(Data!C55,0,(View!$B$27-1)*12)<>\"\",OFFSET(Data!C55,0,(View!$B$27-1)*12),\"\")","v":74.713409999999996},{"$f":"IF(OFFSET(Data!D55,0,(View!$B$27-1)*12)<>\"\",OFFSET(Data!D55,0,(View!$B$27-1)*12),\"\")","v":76.535139999999998},45031249.741392724,"OK",{"$f":"IF(OFFSET(Data!F55,0,(View!$B$27-1)*12)<>\"\",OFFSET(Data!F55,0,(View!$B$27-1)*12),IF($M52<>\"\",#N/A,\"\"))","v":76.730720000000005},{"$f":"IF(OFFSET(Data!G55,0,(View!$B$27-1)*12)<>\"\",OFFSET(Data!G55,0,(View!$B$27-1)*12),IF($N52<>\"\",#N/A,\"\"))","v":77.884789999999995},"OK",{"$f":"IF(OFFSET(Data!I55,0,(View!$B$27-1)*12)<>\"\",OFFSET(Data!I55,0,(View!$B$27-1)*12),IF($M52<>\"\",#N/A,\"\"))","v":77.158519999999996},{"$f":"IF(OFFSET(Data!J55,0,(View!$B$27-1)*12)<>\"\",OFFSET(Data!J55,0,(View!$B$27-1)*12),IF($N52<>\"\",#N/A,\"\"))","v":78.621440000000007},"OK"]
[null,null,null,null,null,null,null,null,null,null,{"$f":"IF(OFFSET(Data!A56,0,(View!$B$27-1)*12)<>\"\",$B$3 + OFFSET(Data!A56,0,(View!$B$27-1)*12),\"\")","v":44474.391747685186},{"$f":"IF(OFFSET(Data!B56,0,(View!$B$27-1)*12)<>\"\",OFFSET(Data!B56,0,(View!$B$27-1)*12),\"\")","v":52},{"$f":"IF(OFFSET(Data!C56,0,(View!$B$27-1)*12)<>\"\",OFFSET(Data!C56,0,(View!$B$27-1)*12),\"\")","v":74.753450000000001},{"$f":"IF(OFFSET(Data!D56,0,(View!$B$27-1)*12)<>\"\",OFFSET(Data!D56,0,(View!$B$27-1)*12),\"\")","v":76.42062},43859330.700728185,"OK",{"$f":"IF(OFFSET(Data!F56,0,(View!$B$27-1)*12)<>\"\",OFFSET(Data!F56,0,(View!$B$27-1)*12),IF($M53<>\"\",#N/A,\"\"))","v":76.74973},{"$f":"IF(OFFSET(Data!G56,0,(View!$B$27-1)*12)<>\"\",OFFSET(Data!G56,0,(View!$B$27-1)*12),IF($N53<>\"\",#N/A,\"\"))","v":77.62312},"OK",{"$f":"IF(OFFSET(Data!I56,0,(View!$B$27-1)*12)<>\"\",OFFSET(Data!I56,0,(View!$B$27-1)*12),IF($M53<>\"\",#N/A,\"\"))","v":77.191860000000005},{"$f":"IF(OFFSET(Data!J56,0,(View!$B$27-1)*12)<>\"\",OFFSET(Data!J56,0,(View!$B$27-1)*12),IF($N53<>\"\",#N/A,\"\"))","v":78.622450000000001},"OK"]
[null,null,null,null,null,null,null,null,null,null,{"$f":"IF(OFFSET(Data!A57,0,(View!$B$27-1)*12)<>\"\",$B$3 + OFFSET(Data!A57,0,(View!$B$27-1)*12),\"\")","v":44474.391759259262},{"$f":"IF(OFFSET(Data!B57,0,(View!$B$27-1)*12)<>\"\",OFFSET(Data!B57,0,(View!$B$27-1)*12),\"\")","v":53},{"$f":"IF(OFFSET(Data!C57,0,(View!$B$27-1)*12)<>\"\",OFFSET(Data!C57,0,(View!$B$27-1)*12),\"\")","v":74.788669999999996},{"$f":"IF(OFFSET(Data!D57,0,(View!$B$27-1)*12)<>\"\",OFFSET(Data!D57,0,(View!$B$27-1)*12),\"\")","v":76.311620000000005},42772240.488981202,"OK",{"$f":"IF(OFFSET(Data!F57,0,(View!$B$27-1)*12)<>\"\",OFFSET(Data!F57,0,(View!$B$27-1)*12),IF($M54<>\"\",#N/A,\"\"))","v":76.766909999999996},{"$f":"IF(OFFSET(Data!G57,0,(View!$B$27-1)*12)<>\"\",OFFSET(Data!G57,0,(View!$B$27-1)*12),IF($N54<>\"\",#N/A,\"\"))","v":77.577849999999998},"OK",{"$f":"IF(OFFSET(Data!I57,0,(View!$B$27-1)*12)<>\"\",OFFSET(Data!I57,0,(View!$B$27-1)*12),IF($M54<>\"\",#N/A,\"\"))","v":77.215829999999997},{"$f":"IF(OFFSET(Data!J57,0,(View!$B$27-1)*12)<>\"\",OFFSET(Data!J57,0,(View!$B$27-1)*12),IF($N54<>\"\",#N/A,\"\"))","v":78.308790000000002},"OK"]
[null,null,null,null,null,null,null,null,null,null,{"$f":"IF(OFFSET(Data!A58,0,(View!$B$27-1)*12)<>\"\",$B$3 + OFFSET(Data!A58,0,(View!$B$27-1)*12),\"\")","v":44474.391770833332},{"$f":"IF(OFFSET(Data!B58,0,(View!$B$27-1)*12)<>\"\",OFFSET(Data!B58,0,(View!$B$27-1)*12),\"\")","v":54},{"$f":"IF(OFFSET(Data!C58,0,(View!$B$27-1)*12)<>\"\",OFFSET(Data!C58,0,(View!$B$27-1)*12),\"\")","v":74.821820000000002},{"$f":"IF(OFFSET(Data!D58,0,(View!$B$27-1)*12)<>\"\",OFFSET(Data!D58,0,(View!$B$27-1)*12),\"\")","v":76.292720000000003},42586505.024763785,"OK",{"$f":"IF(OFFSET(Data!F58,0,(View!$B$27-1)*12)<>\"\",OFFSET(Data!F58,0,(View!$B$27-1)*12),IF($M55<>\"\",#N/A,\"\"))","v":76.781800000000004},{"$f":"IF(OFFSET(Data!G58,0,(View!$B$27-1)*12)<>\"\",OFFSET(Data!G58,0,(View!$B$27-1)*12),IF($N55<>\"\",#N/A,\"\"))","v":77.505600000000001},"OK",{"$f":"IF(OFFSET(Data!I58,0,(View!$B$27-1)*12)<>\"\",OFFSET(Data!I58,0,(View!$B$27-1)*12),IF($M55<>\"\",#N/A,\"\"))","v":77.237700000000004},{"$f":"IF(OFFSET(Data!J58,0,(View!$B$27-1)*12)<>\"\",OFFSET(Data!J58,0,(View!$B$27-1)*12),IF($N55<>\"\",#N/A,\"\"))","v":78.263009999999994},"OK"]
[null,null,null,null,null,null,null,null,null,null,{"$f":"IF(OFFSET(Data!A59,0,(View!$B$27-1)*12)<>\"\",$B$3 + OFFSET(Data!A59,0,(View!$B$27-1)*12),\"\")","v":44474.391782407409},{"$f":"IF(OFFSET(Data!B59,0,(View!$B$27-1)*12)<>\"\",OFFSET(Data!B59,0,(View!$B$27-1)*12),\"\")","v":55},{"$f":"IF(OFFSET(Data!C59,0,(View!$B$27-1)*12)<>\"\",OFFSET(Data!C59,0,(View!$B$27-1)*12),\"\")","v":74.857910000000004},{"$f":"IF(OFFSET(Data!D59,0,(View!$B$27-1)*12)<>\"\",OFFSET(Data!D59,0,(View!$B$27-1)*12),\"\")","v":76.462209999999999},44281365.019934602,"OK",{"$f":"IF(OFFSET(Data!F59,0,(View!$B$27-1)*12)<>\"\",OFFSET(Data!F59,0,(View!$B$27-1)*12),IF($M56<>\"\",#N/A,\"\"))","v":76.797129999999996},{"$f":"IF(OFFSET(Data!G59,0,(View!$B$27-1)*12)<>\"\",OFFSET(Data!G59,0,(View!$B$27-1)*12),IF($N56<>\"\",#N/A,\"\"))","v":77.553830000000005},"OK",{"$f":"IF(OFFSET(Data!I59,0,(View!$B$27-1)*12)<>\"\",OFFSET(Data!I59,0,(View!$B$27-1)*12),IF($M56<>\"\",#N/A,\"\"))","v":77.259429999999995},{"$f":"IF(OFFSET(Data!J59,0,(View!$B$27-1)*12)<>\"\",OFFSET(Data!J59,0,(View!$B$27-1)*12),IF($N56<>\"\",#N/A,\"\"))","v":78.29571},"OK"]
[null,null,null,null,null,null,null,null,null,null,{"$f":"IF(OFFSET(Data!A60,0,(View!$B$27-1)*12)<>\"\",$B$3 + OFFSET(Data!A60,0,(View!$B$27-1)*12),\"\")","v":44474.391793981478},{"$f":"IF(OFFSET(Data!B60,0,(View!$B$27-1)*12)<>\"\",OFFSET(Data!B60,0,(View!$B$27-1)*12),\"\")","v":56},{"$f":"IF(OFFSET(Data!C60,0,(View!$B$27-1)*12)<>\"\",OFFSET(Data!C60,0,(View!$B$27-1)*12),\"\")","v":74.890690000000006},{"$f":"IF(OFFSET(Data!D60,0,(View!$B$27-1)*12)<>\"\",OFFSET(Data!D60,0,(View!$B$27-1)*12),\"\")","v":76.393690000000007},43588206.529234484,"OK",{"$f":"IF(OFFSET(Data!F60,0,(View!$B$27-1)*12)<>\"\",OFFSET(Data!F60,0,(View!$B$27-1)*12),IF($M57<>\"\",#N/A,\"\"))","v":76.810419999999993},{"$f":"IF(OFFSET(Data!G60,0,(View!$B$27-1)*12)<>\"\",OFFSET(Data!G60,0,(View!$B$27-1)*12),IF($N57<>\"\",#N/A,\"\"))","v":77.484970000000004},"OK",{"$f":"IF(OFFSET(Data!I60,0,(View!$B$27-1)*12)<>\"\",OFFSET(Data!I60,0,(View!$B$27-1)*12),IF($M57<>\"\",#N/A,\"\"))","v":77.28098},{"$f":"IF(OFFSET(Data!J60,0,(View!$B$27-1)*12)<>\"\",OFFSET(Data!J60,0,(View!$B$27-1)*12),IF($N57<>\"\",#N/A,\"\"))","v":78.326639999999998},"OK"]
[null,null,null,null,null,null,null,null,null,null,{"$f":"IF(OFFSET(Data!A61,0,(View!$B$27-1)*12)<>\"\",$B$3 + OFFSET(Data!A61,0,(View!$B$27-1)*12),\"\")","v":44474.391805555555},{"$f":"IF(OFFSET(Data!B61,0,(View!$B$27-1)*12)<>\"\",OFFSET(Data!B61,0,(View!$B$27-1)*12),\"\")","v":57},{"$f":"IF(OFFSET(Data!C61,0,(View!$B$27-1)*12)<>\"\",OFFSET(Data!C61,0,(View!$B$27-1)*12),\"\")","v":74.92192},{"$f":"IF(OFFSET(Data!D61,0,(View!$B$27-1)*12)<>\"\",OFFSET(Data!D61,0,(View!$B$27-1)*12),\"\")","v":76.387020000000007},43521314.08499445,"OK",{"$f":"IF(OFFSET(Data!F61,0,(View!$B$27-1)*12)<>\"\",OFFSET(Data!F61,0,(View!$B$27-1)*12),IF($M58<>\"\",#N/A,\"\"))","v":76.82696},{"$f":"IF(OFFSET(Data!G61,0,(View!$B$27-1)*12)<>\"\",OFFSET(Data!G61,0,(View!$B$27-1)*12),IF($N58<>\"\",#N/A,\"\"))","v":77.664969999999997},"OK",{"$f":"IF(OFFSET(Data!I61,0,(View!$B$27-1)*12)<>\"\",OFFSET(Data!I61,0,(View!$B$27-1)*12),IF($M58<>\"\",#N/A,\"\"))","v":77.303910000000002},{"$f":"IF(OFFSET(Data!J61,0,(View!$B$27-1)*12)<>\"\",OFFSET(Data!J61,0,(View!$B$27-1)*12),IF($N58<>\"\",#N/A,\"\"))","v":78.425989999999999},"OK"]
[null,null,null,null,null,null,null,null,null,null,{"$f":"IF(OFFSET(Data!A62,0,(View!$B$27-1)*12)<>\"\",$B$3 + OFFSET(Data!A62,0,(View!$B$27-1)*12),\"\")","v":44474.391817129632},{"$f":"IF(OFFSET(Data!B62,0,(View!$B$27-1)*12)<>\"\",OFFSET(Data!B62,0,(View!$B$27-1)*12),\"\")","v":58},{"$f":"IF(OFFSET(Data!C62,0,(View!$B$27-1)*12)<>\"\",OFFSET(Data!C62,0,(View!$B$27-1)*12),\"\")","v":74.954899999999995},{"$f":"IF(OFFSET(Data!D62,0,(View!$B$27-1)*12)<>\"\",OFFSET(Data!D62,0,(View!$B$27-1)*12),\"\")","v":76.511769999999999},44789581.030719712,"OK",{"$f":"IF(OFFSET(Data!F62,0,(View!$B$27-1)*12)<>\"\",OFFSET(Data!F62,0,(View!$B$27-1)*12),IF($M59<>\"\",#N/A,\"\"))","v":76.841340000000002},{"$f":"IF(OFFSET(Data!G62,0,(View!$B$27-1)*12)<>\"\",OFFSET(Data!G62,0,(View!$B$27-1)*12),IF($N59<>\"\",#N/A,\"\"))","v":77.590900000000005},"OK",{"$f":"IF(OFFSET(Data!I62,0,(View!$B$27-1)*12)<>\"\",OFFSET(Data!I62,0,(View!$B$27-1)*12),IF($M59<>\"\",#N/A,\"\"))","v":77.323939999999993},{"$f":"IF(OFFSET(Data!J62,0,(View!$B$27-1)*12)<>\"\",OFFSET(Data!J62,0,(View!$B$27-1)*12),IF($N59<>\"\",#N/A,\"\"))","v":78.335369999999998},"OK"]
[null,null,null,null,null,null,null,null,null,null,{"$f":"IF(OFFSET(Data!A63,0,(View!$B$27-1)*12)<>\"\",$B$3 + OFFSET(Data!A63,0,(View!$B$27-1)*12),\"\")","v":44474.391828703701},{"$f":"IF(OFFSET(Data!B63,0,(View!$B$27-1)*12)<>\"\",OFFSET(Data!B63,0,(View!$B$27-1)*12),\"\")","v":59},{"$f":"IF(OFFSET(Data!C63,0,(View!$B$27-1)*12)<>\"\",OFFSET(Data!C63,0,(View!$B$27-1)*12),\"\")","v":74.99136},{"$f":"IF(OFFSET(Data!D63,0,(View!$B$27-1)*12)<>\"\",OFFSET(Data!D63,0,(View!$B$27-1)*12),\"\")","v":76.708669999999998},46866983.292713605,"OK",{"$f":"IF(OFFSET(Data!F63,0,(View!$B$27-1)*12)<>\"\",OFFSET(Data!F63,0,(View!$B$27-1)*12),IF($M60<>\"\",#N/A,\"\"))","v":76.862039999999993},{"$f":"IF(OFFSET(Data!G63,0,(View!$B$27-1)*12)<>\"\",OFFSET(Data!G63,0,(View!$B$27-1)*12),IF($N60<>\"\",#N/A,\"\"))","v":77.920010000000005},"OK",{"$f":"IF(OFFSET(Data!I63,0,(View!$B$27-1)*12)<>\"\",OFFSET(Data!I63,0,(View!$B$27-1)*12),IF($M60<>\"\",#N/A,\"\"))","v":77.35033},{"$f":"IF(OFFSET(Data!J63,0,(View!$B$27-1)*12)<>\"\",OFFSET(Data!J63,0,(View!$B$27-1)*12),IF($N60<>\"\",#N/A,\"\"))","v":78.658289999999994},"OK"]
[null,null,null,null,null,null,null,null,null,null,{"$f":"IF(OFFSET(Data!A64,0,(View!$B$27-1)*12)<>\"\",$B$3 + OFFSET(Data!A64,0,(View!$B$27-1)*12),\"\")","v":44474.391840277778},{"$f":"IF(OFFSET(Data!B64,0,(View!$B$27-1)*12)<>\"\",OFFSET(Data!B64,0,(View!$B$27-1)*12),\"\")","v":60},{"$f":"IF(OFFSET(Data!C64,0,(View!$B$27-1)*12)<>\"\",OFFSET(Data!C64,0,(View!$B$27-1)*12),\"\")","v":75.024360000000001},{"$f":"IF(OFFSET(Data!D64,0,(View!$B$27-1)*12)<>\"\",OFFSET(Data!D64,0,(View!$B$27-1)*12),\"\")","v":76.627840000000006},46002771.803382635,"OK",{"$f":"IF(OFFSET(Data!F64,0,(View!$B$27-1)*12)<>\"\",OFFSET(Data!F64,0,(View!$B$27-1)*12),IF($M61<>\"\",#N/A,\"\"))","v":76.880549999999999},{"$f":"IF(OFFSET(Data!G64,0,(View!$B$27-1)*12)<>\"\",OFFSET(Data!G64,0,(View!$B$27-1)*12),IF($N61<>\"\",#N/A,\"\"))","v":77.853200000000001},"OK",{"$f":"IF(OFFSET(Data!I64,0,(View!$B$27-1)*12)<>\"\",OFFSET(Data!I64,0,(View!$B$27-1)*12),IF($M61<>\"\",#N/A,\"\"))","v":77.375690000000006},{"$f":"IF(OFFSET(Data!J64,0,(View!$B$27-1)*12)<>\"\",OFFSET(Data!J64,0,(View!$B$27-1)*12),IF($N61<>\"\",#N/A,\"\"))","v":78.657939999999996},"OK"]
[null,null,null,null,null,null,null,null,null,null,{"$f":"IF(OFFSET(Data!A65,0,(View!$B$27-1)*12)<>\"\",$B$3 + OFFSET(Data!A65,0,(View!$B$27-1)*12),\"\")","v":44474.391851851855},{"$f":"IF(OFFSET(Data!B65,0,(View!$B$27-1)*12)<>\"\",OFFSET(Data!B65,0,(View!$B$27-1)*12),\"\")","v":61},{"$f":"IF(OFFSET(Data!C65,0,(View!$B$27-1)*12)<>\"\",OFFSET(Data!C65,0,(View!$B$27-1)*12),\"\")","v":75.053790000000006},{"$f":"IF(OFFSET(Data!D65,0,(View!$B$27-1)*12)<>\"\",OFFSET(Data!D65,0,(View!$B$27-1)*12),\"\")","v":76.531139999999994},44989793.521868743,"OK",{"$f":"IF(OFFSET(Data!F65,0,(View!$B$27-1)*12)<>\"\",OFFSET(Data!F65,0,(View!$B$27-1)*12),IF($M62<>\"\",#N/A,\"\"))","v":76.89564},{"$f":"IF(OFFSET(Data!G65,0,(View!$B$27-1)*12)<>\"\",OFFSET(Data!G65,0,(View!$B$27-1)*12),IF($N62<>\"\",#N/A,\"\"))","v":77.716160000000002},"OK",{"$f":"IF(OFFSET(Data!I65,0,(View!$B$27-1)*12)<>\"\",OFFSET(Data!I65,0,(View!$B$27-1)*12),IF($M62<>\"\",#N/A,\"\"))","v":77.396169999999998},{"$f":"IF(OFFSET(Data!J65,0,(View!$B$27-1)*12)<>\"\",OFFSET(Data!J65,0,(View!$B$27-1)*12),IF($N62<>\"\",#N/A,\"\"))","v":78.476410000000001},"OK"]
[null,null,null,null,null,null,null,null,null,null,{"$f":"IF(OFFSET(Data!A66,0,(View!$B$27-1)*12)<>\"\",$B$3 + OFFSET(Data!A66,0,(View!$B$27-1)*12),\"\")","v":44474.391863425924},{"$f":"IF(OFFSET(Data!B66,0,(View!$B$27-1)*12)<>\"\",OFFSET(Data!B66,0,(View!$B$27-1)*12),\"\")","v":62},{"$f":"IF(OFFSET(Data!C66,0,(View!$B$27-1)*12)<>\"\",OFFSET(Data!C66,0,(View!$B$27-1)*12),\"\")","v":75.081810000000004},{"$f":"IF(OFFSET(Data!D66,0,(View!$B$27-1)*12)<>\"\",OFFSET(Data!D66,0,(View!$B$27-1)*12),\"\")","v":76.519090000000006},44865137.180899985,"OK",{"$f":"IF(OFFSET(Data!F66,0,(View!$B$27-1)*12)<>\"\",OFFSET(Data!F66,0,(View!$B$27-1)*12),IF($M63<>\"\",#N/A,\"\"))","v":76.912989999999994},{"$f":"IF(OFFSET(Data!G66,0,(View!$B$27-1)*12)<>\"\",OFFSET(Data!G66,0,(View!$B$27-1)*12),IF($N63<>\"\",#N/A,\"\"))","v":77.858440000000002},"OK",{"$f":"IF(OFFSET(Data!I66,0,(View!$B$27-1)*12)<>\"\",OFFSET(Data!I66,0,(View!$B$27-1)*12),IF($M63<>\"\",#N/A,\"\"))","v":77.419619999999995},{"$f":"IF(OFFSET(Data!J66,0,(View!$B$27-1)*12)<>\"\",OFFSET(Data!J66,0,(View!$B$27-1)*12),IF($N63<>\"\",#N/A,\"\"))","v":78.653400000000005},"OK"]
[null,null,null,null,null,null,null,null,null,null,{"$f":"IF(OFFSET(Data!A67,0,(View!$B$27-1)*12)<>\"\",$B$3 + OFFSET(Data!A67,0,(View!$B$27-1)*12),\"\")","v":44474.391875000001},{"$f":"IF(OFFSET(Data!B67,0,(View!$B$27-1)*12)<>\"\",OFFSET(Data!B67,0,(View!$B$27-1)*12),\"\")","v":63},{"$f":"IF(OFFSET(Data!C67,0,(View!$B$27-1)*12)<>\"\",OFFSET(Data!C67,0,(View!$B$27-1)*12),\"\")","v":75.108199999999997},{"$f":"IF(OFFSET(Data!D67,0,(View!$B$27-1)*12)<>\"\",OFFSET(Data!D67,0,(View!$B$27-1)*12),\"\")","v":76.493219999999994},44598679.49031055,"OK",{"$f":"IF(OFFSET(Data!F67,0,(View!$B$27-1)*12)<>\"\",OFFSET(Data!F67,0,(View!$B$27-1)*12),IF($M64<>\"\",#N/A,\"\"))","v":76.928539999999998},{"$f":"IF(OFFSET(Data!G67,0,(View!$B$27-1)*12)<>\"\",OFFSET(Data!G67,0,(View!$B$27-1)*12),IF($N64<>\"\",#N/A,\"\"))","v":77.797960000000003},"OK",{"$f":"IF(OFFSET(Data!I67,0,(View!$B$27-1)*12)<>\"\",OFFSET(Data!I67,0,(View!$B$27-1)*12),IF($M64<>\"\",#N/A,\"\"))","v":77.440129999999996},{"$f":"IF(OFFSET(Data!J67,0,(View!$B$27-1)*12)<>\"\",OFFSET(Data!J67,0,(View!$B$27-1)*12),IF($N64<>\"\",#N/A,\"\"))","v":78.55274},"OK"]
[null,null,null,null,null,null,null,null,null,null,{"$f":"IF(OFFSET(Data!A68,0,(View!$B$27-1)*12)<>\"\",$B$3 + OFFSET(Data!A68,0,(View!$B$27-1)*12),\"\")","v":44474.391886574071},{"$f":"IF(OFFSET(Data!B68,0,(View!$B$27-1)*12)<>\"\",OFFSET(Data!B68,0,(View!$B$27-1)*12),\"\")","v":64},{"$f":"IF(OFFSET(Data!C68,0,(View!$B$27-1)*12)<>\"\",OFFSET(Data!C68,0,(View!$B$27-1)*12),\"\")","v":75.136259999999993},{"$f":"IF(OFFSET(Data!D68,0,(View!$B$27-1)*12)<>\"\",OFFSET(Data!D68,0,(View!$B$27-1)*12),\"\")","v":76.615430000000003},45871506.145972252,"OK",{"$f":"IF(OFFSET(Data!F68,0,(View!$B$27-1)*12)<>\"\",OFFSET(Data!F68,0,(View!$B$27-1)*12),IF($M65<>\"\",#N/A,\"\"))","v":76.943169999999995},{"$f":"IF(OFFSET(Data!G68,0,(View!$B$27-1)*12)<>\"\",OFFSET(Data!G68,0,(View!$B$27-1)*12),IF($N65<>\"\",#N/A,\"\"))","v":77.777860000000004},"OK",{"$f":"IF(OFFSET(Data!I68,0,(View!$B$27-1)*12)<>\"\",OFFSET(Data!I68,0,(View!$B$27-1)*12),IF($M65<>\"\",#N/A,\"\"))","v":77.459500000000006},{"$f":"IF(OFFSET(Data!J68,0,(View!$B$27-1)*12)<>\"\",OFFSET(Data!J68,0,(View!$B$27-1)*12),IF($N65<>\"\",#N/A,\"\"))","v":78.532510000000002},"OK"]
[null,null,null,null,null,null,null,null,null,null,{"$f":"IF(OFFSET(Data!A69,0,(View!$B$27-1)*12)<>\"\",$B$3 + OFFSET(Data!A69,0,(View!$B$27-1)*12),\"\")","v":44474.391898148147},{"$f":"IF(OFFSET(Data!B69,0,(View!$B$27-1)*12)<>\"\",OFFSET(Data!B69,0,(View!$B$27-1)*12),\"\")","v":65},{"$f":"IF(OFFSET(Data!C69,0,(View!$B$27-1)*12)<>\"\",OFFSET(Data!C69,0,(View!$B$27-1)*12),\"\")","v":75.164730000000006},{"$f":"IF(OFFSET(Data!D69,0,(View!$B$27-1)*12)<>\"\",OFFSET(Data!D69,0,(View!$B$27-1)*12),\"\")","v":76.681759999999997},46577481.284142539,"OK",{"$f":"IF(OFFSET(Data!F69,0,(View!$B$27-1)*12)<>\"\",OFFSET(Data!F69,0,(View!$B$27-1)*12),IF($M66<>\"\",#N/A,\"\"))","v":76.958160000000007},{"$f":"IF(OFFSET(Data!G69,0,(View!$B$27-1)*12)<>\"\",OFFSET(Data!G69,0,(View!$B$27-1)*12),IF($N66<>\"\",#N/A,\"\"))","v":77.823539999999994},"OK",{"$f":"IF(OFFSET(Data!I69,0,(View!$B$27-1)*12)<>\"\",OFFSET(Data!I69,0,(View!$B$27-1)*12),IF($M66<>\"\",#N/A,\"\"))","v":77.478679999999997},{"$f":"IF(OFFSET(Data!J69,0,(View!$B$27-1)*12)<>\"\",OFFSET(Data!J69,0,(View!$B$27-1)*12),IF($N66<>\"\",#N/A,\"\"))","v":78.557779999999994},"OK"]
[null,null,null,null,null,null,null,null,null,null,{"$f":"IF(OFFSET(Data!A70,0,(View!$B$27-1)*12)<>\"\",$B$3 + OFFSET(Data!A70,0,(View!$B$27-1)*12),\"\")","v":44474.391909722224},{"$f":"IF(OFFSET(Data!B70,0,(View!$B$27-1)*12)<>\"\",OFFSET(Data!B70,0,(View!$B$27-1)*12),\"\")","v":66},{"$f":"IF(OFFSET(Data!C70,0,(View!$B$27-1)*12)<>\"\",OFFSET(Data!C70,0,(View!$B$27-1)*12),\"\")","v":75.187970000000007},{"$f":"IF(OFFSET(Data!D70,0,(View!$B$27-1)*12)<>\"\",OFFSET(Data!D70,0,(View!$B$27-1)*12),\"\")","v":76.481549999999999},{"$f":"10^(N67/10)","v":44478998.499651648},{"$f":"IF(M67<>\"\",IF(M67<$B$8,IF(N67<$B$8,\"OK\",\"Current\"),\"Average\"),\"\")","v":"OK"},{"$f":"IF(OFFSET(Data!F70,0,(View!$B$27-1)*12)<>\"\",OFFSET(Data!F70,0,(View!$B$27-1)*12),IF($M67<>\"\",#N/A,\"\"))","v":76.968609999999998},{"$f":"IF(OFFSET(Data!G70,0,(View!$B$27-1)*12)<>\"\",OFFSET(Data!G70,0,(View!$B$27-1)*12),IF($N67<>\"\",#N/A,\"\"))","v":77.599299999999999},{"$f":"IF(Q67<>\"\",IF(Q67<$B$8,IF(R67<$B$8,\"OK\",\"Current\"),\"Average\"),\"\")","v":"OK"},{"$f":"IF(OFFSET(Data!I70,0,(View!$B$27-1)*12)<>\"\",OFFSET(Data!I70,0,(View!$B$27-1)*12),IF($M67<>\"\",#N/A,\"\"))","v":77.493099999999998},{"$f":"IF(OFFSET(Data!J70,0,(View!$B$27-1)*12)<>\"\",OFFSET(Data!J70,0,(View!$B$27-1)*12),IF($N67<>\"\",#N/A,\"\"))","v":78.340519999999998},{"$f":"IF(T67<>\"\",IF(T67<$B$8,IF(U67<$B$8,\"OK\",\"Current\"),\"Average\"),\"\")","v":"OK"}]
[null,null,null,null,null,null,null,null,null,null,{"$f":"IF(OFFSET(Data!A71,0,(View!$B$27-1)*12)<>\"\",$B$3 + OFFSET(Data!A71,0,(View!$B$27-1)*12),\"\")","v":44474.391921296294},{"$f":"IF(OFFSET(Data!B71,0,(View!$B$27-1)*12)<>\"\",OFFSET(Data!B71,0,(View!$B$27-1)*12),\"\")","v":67},{"$f":"IF(OFFSET(Data!C71,0,(View!$B$27-1)*12)<>\"\",OFFSET(Data!C71,0,(View!$B$27-1)*12),\"\")","v":75.211190000000002},{"$f":"IF(OFFSET(Data!D71,0,(View!$B$27-1)*12)<>\"\",OFFSET(Data!D71,0,(View!$B$27-1)*12),\"\")","v":76.520520000000005},44879912.342110455,"OK",{"$f":"IF(OFFSET(Data!F71,0,(View!$B$27-1)*12)<>\"\",OFFSET(Data!F71,0,(View!$B$27-1)*12),IF($M68<>\"\",#N/A,\"\"))","v":76.98424},{"$f":"IF(OFFSET(Data!G71,0,(View!$B$27-1)*12)<>\"\",OFFSET(Data!G71,0,(View!$B$27-1)*12),IF($N68<>\"\",#N/A,\"\"))","v":77.907920000000004},"OK",{"$f":"IF(OFFSET(Data!I71,0,(View!$B$27-1)*12)<>\"\",OFFSET(Data!I71,0,(View!$B$27-1)*12),IF($M68<>\"\",#N/A,\"\"))","v":77.511989999999997},{"$f":"IF(OFFSET(Data!J71,0,(View!$B$27-1)*12)<>\"\",OFFSET(Data!J71,0,(View!$B$27-1)*12),IF($N68<>\"\",#N/A,\"\"))","v":78.606070000000003},"OK"]
[null,null,null,null,null,null,null,null,null,null,{"$f":"IF(OFFSET(Data!A72,0,(View!$B$27-1)*12)<>\"\",$B$3 + OFFSET(Data!A72,0,(View!$B$27-1)*12),\"\")","v":44474.391932870371},{"$f":"IF(OFFSET(Data!B72,0,(View!$B$27-1)*12)<>\"\",OFFSET(Data!B72,0,(View!$B$27-1)*12),\"\")","v":68},{"$f":"IF(OFFSET(Data!C72,0,(View!$B$27-1)*12)<>\"\",OFFSET(Data!C72,0,(View!$B$27-1)*12),\"\")","v":75.232219999999998},{"$f":"IF(OFFSET(Data!D72,0,(View!$B$27-1)*12)<>\"\",OFFSET(Data!D72,0,(View!$B$27-1)*12),\"\")","v":76.450069999999997},44157756.468537912,"OK",{"$f":"IF(OFFSET(Data!F72,0,(View!$B$27-1)*12)<>\"\",OFFSET(Data!F72,0,(View!$B$27-1)*12),IF($M69<>\"\",#N/A,\"\"))","v":76.995450000000005},{"$f":"IF(OFFSET(Data!G72,0,(View!$B$27-1)*12)<>\"\",OFFSET(Data!G72,0,(View!$B$27-1)*12),IF($N69<>\"\",#N/A,\"\"))","v":77.687730000000002},"OK",{"$f":"IF(OFFSET(Data!I72,0,(View!$B$27-1)*12)<>\"\",OFFSET(Data!I72,0,(View!$B$27-1)*12),IF($M69<>\"\",#N/A,\"\"))","v":77.526499999999999},{"$f":"IF(OFFSET(Data!J72,0,(View!$B$27-1)*12)<>\"\",OFFSET(Data!J72,0,(View!$B$27-1)*12),IF($N69<>\"\",#N/A,\"\"))","v":78.402699999999996},"OK"]
[null,null,null,null,null,null,null,null,null,null,{"$f":"IF(OFFSET(Data!A73,0,(View!$B$27-1)*12)<>\"\",$B$3 + OFFSET(Data!A73,0,(View!$B$27-1)*12),\"\")","v":44474.391944444447},{"$f":"IF(OFFSET(Data!B73,0,(View!$B$27-1)*12)<>\"\",OFFSET(Data!B73,0,(View!$B$27-1)*12),\"\")","v":69},{"$f":"IF(OFFSET(Data!C73,0,(View!$B$27-1)*12)<>\"\",OFFSET(Data!C73,0,(View!$B$27-1)*12),\"\")","v":75.251400000000004},{"$f":"IF(OFFSET(Data!D73,0,(View!$B$27-1)*12)<>\"\",OFFSET(Data!D73,0,(View!$B$27-1)*12),\"\")","v":76.389449999999997},43545672.30046951,"OK",{"$f":"IF(OFFSET(Data!F73,0,(View!$B$27-1)*12)<>\"\",OFFSET(Data!F73,0,(View!$B$27-1)*12),IF($M70<>\"\",#N/A,\"\"))","v":77.006529999999998},{"$f":"IF(OFFSET(Data!G73,0,(View!$B$27-1)*12)<>\"\",OFFSET(Data!G73,0,(View!$B$27-1)*12),IF($N70<>\"\",#N/A,\"\"))","v":77.700090000000003},"OK",{"$f":"IF(OFFSET(Data!I73,0,(View!$B$27-1)*12)<>\"\",OFFSET(Data!I73,0,(View!$B$27-1)*12),IF($M70<>\"\",#N/A,\"\"))","v":77.54074},{"$f":"IF(OFFSET(Data!J73,0,(View!$B$27-1)*12)<>\"\",OFFSET(Data!J73,0,(View!$B$27-1)*12),IF($N70<>\"\",#N/A,\"\"))","v":78.413539999999998},"OK"]
[null,null,null,null,null,null,null,null,null,null,{"$f":"IF(OFFSET(Data!A74,0,(View!$B$27-1)*12)<>\"\",$B$3 + OFFSET(Data!A74,0,(View!$B$27-1)*12),\"\")","v":44474.391956018517},{"$f":"IF(OFFSET(Data!B74,0,(View!$B$27-1)*12)<>\"\",OFFSET(Data!B74,0,(View!$B$27-1)*12),\"\")","v":70},{"$f":"IF(OFFSET(Data!C74,0,(View!$B$27-1)*12)<>\"\",OFFSET(Data!C74,0,(View!$B$27-1)*12),\"\")","v":75.268940000000001},{"$f":"IF(OFFSET(Data!D74,0,(View!$B$27-1)*12)<>\"\",OFFSET(Data!D74,0,(View!$B$27-1)*12),\"\")","v":76.334419999999994},42997380.682183489,"OK",{"$f":"IF(OFFSET(Data!F74,0,(View!$B$27-1)*12)<>\"\",OFFSET(Data!F74,0,(View!$B$27-1)*12),IF($M71<>\"\",#N/A,\"\"))","v":77.014210000000006},{"$f":"IF(OFFSET(Data!G74,0,(View!$B$27-1)*12)<>\"\",OFFSET(Data!G74,0,(View!$B$27-1)*12),IF($N71<>\"\",#N/A,\"\"))","v":77.513900000000007},"OK",{"$f":"IF(OFFSET(Data!I74,0,(View!$B$27-1)*12)<>\"\",OFFSET(Data!I74,0,(View!$B$27-1)*12),IF($M71<>\"\",#N/A,\"\"))","v":77.551739999999995},{"$f":"IF(OFFSET(Data!J74,0,(View!$B$27-1)*12)<>\"\",OFFSET(Data!J74,0,(View!$B$27-1)*12),IF($N71<>\"\",#N/A,\"\"))","v":78.250429999999994},"OK"]
[null,null,null,null,null,null,null,null,null,null,{"$f":"IF(OFFSET(Data!A75,0,(View!$B$27-1)*12)<>\"\",$B$3 + OFFSET(Data!A75,0,(View!$B$27-1)*12),\"\")","v":44474.391967592594},{"$f":"IF(OFFSET(Data!B75,0,(View!$B$27-1)*12)<>\"\",OFFSET(Data!B75,0,(View!$B$27-1)*12),\"\")","v":71},{"$f":"IF(OFFSET(Data!C75,0,(View!$B$27-1)*12)<>\"\",OFFSET(Data!C75,0,(View!$B$27-1)*12),\"\")","v":75.286720000000003},{"$f":"IF(OFFSET(Data!D75,0,(View!$B$27-1)*12)<>\"\",OFFSET(Data!D75,0,(View!$B$27-1)*12),\"\")","v":76.379329999999996},43444319.605877571,"OK",{"$f":"IF(OFFSET(Data!F75,0,(View!$B$27-1)*12)<>\"\",OFFSET(Data!F75,0,(View!$B$27-1)*12),IF($M72<>\"\",#N/A,\"\"))","v":77.023669999999996},{"$f":"IF(OFFSET(Data!G75,0,(View!$B$27-1)*12)<>\"\",OFFSET(Data!G75,0,(View!$B$27-1)*12),IF($N72<>\"\",#N/A,\"\"))","v":77.639049999999997},"OK",{"$f":"IF(OFFSET(Data!I75,0,(View!$B$27-1)*12)<>\"\",OFFSET(Data!I75,0,(View!$B$27-1)*12),IF($M72<>\"\",#N/A,\"\"))","v":77.564760000000007},{"$f":"IF(OFFSET(Data!J75,0,(View!$B$27-1)*12)<>\"\",OFFSET(Data!J75,0,(View!$B$27-1)*12),IF($N72<>\"\",#N/A,\"\"))","v":78.390820000000005},"OK"]
[null,null,null,null,null,null,null,null,null,null,{"$f":"IF(OFFSET(Data!A76,0,(View!$B$27-1)*12)<>\"\",$B$3 + OFFSET(Data!A76,0,(View!$B$27-1)*12),\"\")","v":44474.391979166663},{"$f":"IF(OFFSET(Data!B76,0,(View!$B$27-1)*12)<>\"\",OFFSET(Data!B76,0,(View!$B$27-1)*12),\"\")","v":72},{"$f":"IF(OFFSET(Data!C76,0,(View!$B$27-1)*12)<>\"\",OFFSET(Data!C76,0,(View!$B$27-1)*12),\"\")","v":75.301640000000006},{"$f":"IF(OFFSET(Data!D76,0,(View!$B$27-1)*12)<>\"\",OFFSET(Data!D76,0,(View!$B$27-1)*12),\"\")","v":76.248059999999995},42150817.303143285,"OK",{"$f":"IF(OFFSET(Data!F76,0,(View!$B$27-1)*12)<>\"\",OFFSET(Data!F76,0,(View!$B$27-1)*12),IF($M73<>\"\",#N/A,\"\"))","v":77.030940000000001},{"$f":"IF(OFFSET(Data!G76,0,(View!$B$27-1)*12)<>\"\",OFFSET(Data!G76,0,(View!$B$27-1)*12),IF($N73<>\"\",#N/A,\"\"))","v":77.519120000000001},"OK",{"$f":"IF(OFFSET(Data!I76,0,(View!$B$27-1)*12)<>\"\",OFFSET(Data!I76,0,(View!$B$27-1)*12),IF($M73<>\"\",#N/A,\"\"))","v":77.576520000000002},{"$f":"IF(OFFSET(Data!J76,0,(View!$B$27-1)*12)<>\"\",OFFSET(Data!J76,0,(View!$B$27-1)*12),IF($N73<>\"\",#N/A,\"\"))","v":78.338750000000005},"OK"]
[null,null,null,null,null,null,null,null,null,null,{"$f":"IF(OFFSET(Data!A77,0,(View!$B$27-1)*12)<>\"\",$B$3 + OFFSET(Data!A77,0,(View!$B$27-1)*12),\"\")","v":44474.39199074074},{"$f":"IF(OFFSET(Data!B77,0,(View!$B$27-1)*12)<>\"\",OFFSET(Data!B77,0,(View!$B$27-1)*12),\"\")","v":73},{"$f":"IF(OFFSET(Data!C77,0,(View!$B$27-1)*12)<>\"\",OFFSET(Data!C77,0,(View!$B$27-1)*12),\"\")","v":75.31832},{"$f":"IF(OFFSET(Data!D77,0,(View!$B$27-1)*12)<>\"\",OFFSET(Data!D77,0,(View!$B$27-1)*12),\"\")","v":76.377210000000005},43423117.52172415,"OK",{"$f":"IF(OFFSET(Data!F77,0,(View!$B$27-1)*12)<>\"\",OFFSET(Data!F77,0,(View!$B$27-1)*12),IF($M74<>\"\",#N/A,\"\"))","v":77.039619999999999},{"$f":"IF(OFFSET(Data!G77,0,(View!$B$27-1)*12)<>\"\",OFFSET(Data!G77,0,(View!$B$27-1)*12),IF($N74<>\"\",#N/A,\"\"))","v":77.622320000000002},"OK",{"$f":"IF(OFFSET(Data!I77,0,(View!$B$27-1)*12)<>\"\",OFFSET(Data!I77,0,(View!$B$27-1)*12),IF($M74<>\"\",#N/A,\"\"))","v":77.587710000000001},{"$f":"IF(OFFSET(Data!J77,0,(View!$B$27-1)*12)<>\"\",OFFSET(Data!J77,0,(View!$B$27-1)*12),IF($N74<>\"\",#N/A,\"\"))","v":78.326160000000002},"OK"]
[null,null,null,null,null,null,null,null,null,null,{"$f":"IF(OFFSET(Data!A78,0,(View!$B$27-1)*12)<>\"\",$B$3 + OFFSET(Data!A78,0,(View!$B$27-1)*12),\"\")","v":44474.392002314817},{"$f":"IF(OFFSET(Data!B78,0,(View!$B$27-1)*12)<>\"\",OFFSET(Data!B78,0,(View!$B$27-1)*12),\"\")","v":74},{"$f":"IF(OFFSET(Data!C78,0,(View!$B$27-1)*12)<>\"\",OFFSET(Data!C78,0,(View!$B$27-1)*12),\"\")","v":75.338200000000001},{"$f":"IF(OFFSET(Data!D78,0,(View!$B$27-1)*12)<>\"\",OFFSET(Data!D78,0,(View!$B$27-1)*12),\"\")","v":76.587850000000003},45581120.810692213,"OK",{"$f":"IF(OFFSET(Data!F78,0,(View!$B$27-1)*12)<>\"\",OFFSET(Data!F78,0,(View!$B$27-1)*12),IF($M75<>\"\",#N/A,\"\"))","v":77.049030000000002},{"$f":"IF(OFFSET(Data!G78,0,(View!$B$27-1)*12)<>\"\",OFFSET(Data!G78,0,(View!$B$27-1)*12),IF($N75<>\"\",#N/A,\"\"))","v":77.686580000000006},"OK",{"$f":"IF(OFFSET(Data!I78,0,(View!$B$27-1)*12)<>\"\",OFFSET(Data!I78,0,(View!$B$27-1)*12),IF($M75<>\"\",#N/A,\"\"))","v":77.601309999999998},{"$f":"IF(OFFSET(Data!J78,0,(View!$B$27-1)*12)<>\"\",OFFSET(Data!J78,0,(View!$B$27-1)*12),IF($N75<>\"\",#N/A,\"\"))","v":78.494380000000007},"OK"]
[null,null,null,null,null,null,null,null,null,null,{"$f":"IF(OFFSET(Data!A79,0,(View!$B$27-1)*12)<>\"\",$B$3 + OFFSET(Data!A79,0,(View!$B$27-1)*12),\"\")","v":44474.392013888886},{"$f":"IF(OFFSET(Data!B79,0,(View!$B$27-1)*12)<>\"\",OFFSET(Data!B79,0,(View!$B$27-1)*12),\"\")","v":75},{"$f":"IF(OFFSET(Data!C79,0,(View!$B$27-1)*12)<>\"\",OFFSET(Data!C79,0,(View!$B$27-1)*12),\"\")","v":75.361059999999995},{"$f":"IF(OFFSET(Data!D79,0,(View!$B$27-1)*12)<>\"\",OFFSET(Data!D79,0,(View!$B$27-1)*12),\"\")","v":76.786280000000005},47712041.552402958,"OK",{"$f":"IF(OFFSET(Data!F79,0,(View!$B$27-1)*12)<>\"\",OFFSET(Data!F79,0,(View!$B$27-1)*12),IF($M76<>\"\",#N/A,\"\"))","v":77.064160000000001},{"$f":"IF(OFFSET(Data!G79,0,(View!$B$27-1)*12)<>\"\",OFFSET(Data!G79,0,(View!$B$27-1)*12),IF($N76<>\"\",#N/A,\"\"))","v":78.058430000000001},"OK",{"$f":"IF(OFFSET(Data!I79,0,(View!$B$27-1)*12)<>\"\",OFFSET(Data!I79,0,(View!$B$27-1)*12),IF($M76<>\"\",#N/A,\"\"))","v":77.619709999999998},{"$f":"IF(OFFSET(Data!J79,0,(View!$B$27-1)*12)<>\"\",OFFSET(Data!J79,0,(View!$B$27-1)*12),IF($N76<>\"\",#N/A,\"\"))","v":78.801730000000006},"OK"]
[null,null,null,null,null,null,null,null,null,null,{"$f":"IF(OFFSET(Data!A80,0,(View!$B$27-1)*12)<>\"\",$B$3 + OFFSET(Data!A80,0,(View!$B$27-1)*12),\"\")","v":44474.392025462963},{"$f":"IF(OFFSET(Data!B80,0,(View!$B$27-1)*12)<>\"\",OFFSET(Data!B80,0,(View!$B$27-1)*12),\"\")","v":76},{"$f":"IF(OFFSET(Data!C80,0,(View!$B$27-1)*12)<>\"\",OFFSET(Data!C80,0,(View!$B$27-1)*12),\"\")","v":75.394289999999998},{"$f":"IF(OFFSET(Data!D80,0,(View!$B$27-1)*12)<>\"\",OFFSET(Data!D80,0,(View!$B$27-1)*12),\"\")","v":77.357990000000001},54425070.464820407,"OK",{"$f":"IF(OFFSET(Data!F80,0,(View!$B$27-1)*12)<>\"\",OFFSET(Data!F80,0,(View!$B$27-1)*12),IF($M77<>\"\",#N/A,\"\"))","v":77.086370000000002},{"$f":"IF(OFFSET(Data!G80,0,(View!$B$27-1)*12)<>\"\",OFFSET(Data!G80,0,(View!$B$27-1)*12),IF($N77<>\"\",#N/A,\"\"))","v":78.493279999999999},"OK",{"$f":"IF(OFFSET(Data!I80,0,(View!$B$27-1)*12)<>\"\",OFFSET(Data!I80,0,(View!$B$27-1)*12),IF($M77<>\"\",#N/A,\"\"))","v":77.645809999999997},{"$f":"IF(OFFSET(Data!J80,0,(View!$B$27-1)*12)<>\"\",OFFSET(Data!J80,0,(View!$B$27-1)*12),IF($N77<>\"\",#N/A,\"\"))","v":79.257580000000004},"OK"]
[null,null,null,null,null,null,null,null,null,null,{"$f":"IF(OFFSET(Data!A81,0,(View!$B$27-1)*12)<>\"\",$B$3 + OFFSET(Data!A81,0,(View!$B$27-1)*12),\"\")","v":44474.39203703704},{"$f":"IF(OFFSET(Data!B81,0,(View!$B$27-1)*12)<>\"\",OFFSET(Data!B81,0,(View!$B$27-1)*12),\"\")","v":77},{"$f":"IF(OFFSET(Data!C81,0,(View!$B$27-1)*12)<>\"\",OFFSET(Data!C81,0,(View!$B$27-1)*12),\"\")","v":75.45626},{"$f":"IF(OFFSET(Data!D81,0,(View!$B$27-1)*12)<>\"\",OFFSET(Data!D81,0,(View!$B$27-1)*12),\"\")","v":78.630099999999999},72947430.682783708,"OK",{"$f":"IF(OFFSET(Data!F81,0,(View!$B$27-1)*12)<>\"\",OFFSET(Data!F81,0,(View!$B$27-1)*12),IF($M78<>\"\",#N/A,\"\"))","v":77.135379999999998},{"$f":"IF(OFFSET(Data!G81,0,(View!$B$27-1)*12)<>\"\",OFFSET(Data!G81,0,(View!$B$27-1)*12),IF($N78<>\"\",#N/A,\"\"))","v":79.813929999999999},"OK",{"$f":"IF(OFFSET(Data!I81,0,(View!$B$27-1)*12)<>\"\",OFFSET(Data!I81,0,(View!$B$27-1)*12),IF($M78<>\"\",#N/A,\"\"))","v":77.69802},{"$f":"IF(OFFSET(Data!J81,0,(View!$B$27-1)*12)<>\"\",OFFSET(Data!J81,0,(View!$B$27-1)*12),IF($N78<>\"\",#N/A,\"\"))","v":80.504279999999994},"OK"]
[null,null,null,null,null,null,null,null,null,null,{"$f":"IF(OFFSET(Data!A82,0,(View!$B$27-1)*12)<>\"\",$B$3 + OFFSET(Data!A82,0,(View!$B$27-1)*12),\"\")","v":44474.392048611109},{"$f":"IF(OFFSET(Data!B82,0,(View!$B$27-1)*12)<>\"\",OFFSET(Data!B82,0,(View!$B$27-1)*12),\"\")","v":78},{"$f":"IF(OFFSET(Data!C82,0,(View!$B$27-1)*12)<>\"\",OFFSET(Data!C82,0,(View!$B$27-1)*12),\"\")","v":75.520449999999997},{"$f":"IF(OFFSET(Data!D82,0,(View!$B$27-1)*12)<>\"\",OFFSET(Data!D82,0,(View!$B$27-1)*12),\"\")","v":78.803470000000004},75918391.845762715,"OK",{"$f":"IF(OFFSET(Data!F82,0,(View!$B$27-1)*12)<>\"\",OFFSET(Data!F82,0,(View!$B$27-1)*12),IF($M79<>\"\",#N/A,\"\"))","v":77.187119999999993},{"$f":"IF(OFFSET(Data!G82,0,(View!$B$27-1)*12)<>\"\",OFFSET(Data!G82,0,(View!$B$27-1)*12),IF($N79<>\"\",#N/A,\"\"))","v":80.001639999999995},"OK",{"$f":"IF(OFFSET(Data!I82,0,(View!$B$27-1)*12)<>\"\",OFFSET(Data!I82,0,(View!$B$27-1)*12),IF($M79<>\"\",#N/A,\"\"))","v":77.752099999999999},{"$f":"IF(OFFSET(Data!J82,0,(View!$B$27-1)*12)<>\"\",OFFSET(Data!J82,0,(View!$B$27-1)*12),IF($N79<>\"\",#N/A,\"\"))","v":80.658779999999993},"OK"]
[null,null,null,null,null,null,null,null,null,null,{"$f":"IF(OFFSET(Data!A83,0,(View!$B$27-1)*12)<>\"\",$B$3 + OFFSET(Data!A83,0,(View!$B$27-1)*12),\"\")","v":44474.392060185186},{"$f":"IF(OFFSET(Data!B83,0,(View!$B$27-1)*12)<>\"\",OFFSET(Data!B83,0,(View!$B$27-1)*12),\"\")","v":79},{"$f":"IF(OFFSET(Data!C83,0,(View!$B$27-1)*12)<>\"\",OFFSET(Data!C83,0,(View!$B$27-1)*12),\"\")","v":75.560389999999998},{"$f":"IF(OFFSET(Data!D83,0,(View!$B$27-1)*12)<>\"\",OFFSET(Data!D83,0,(View!$B$27-1)*12),\"\")","v":77.900790000000001},61670717.329771928,"OK",{"$f":"IF(OFFSET(Data!F83,0,(View!$B$27-1)*12)<>\"\",OFFSET(Data!F83,0,(View!$B$27-1)*12),IF($M80<>\"\",#N/A,\"\"))","v":77.222359999999995},{"$f":"IF(OFFSET(Data!G83,0,(View!$B$27-1)*12)<>\"\",OFFSET(Data!G83,0,(View!$B$27-1)*12),IF($N80<>\"\",#N/A,\"\"))","v":79.34496},"OK",{"$f":"IF(OFFSET(Data!I83,0,(View!$B$27-1)*12)<>\"\",OFFSET(Data!I83,0,(View!$B$27-1)*12),IF($M80<>\"\",#N/A,\"\"))","v":77.789140000000003},{"$f":"IF(OFFSET(Data!J83,0,(View!$B$27-1)*12)<>\"\",OFFSET(Data!J83,0,(View!$B$27-1)*12),IF($N80<>\"\",#N/A,\"\"))","v":79.996600000000001},"OK"]
[null,null,null,null,null,null,null,null,null,null,{"$f":"IF(OFFSET(Data!A84,0,(View!$B$27-1)*12)<>\"\",$B$3 + OFFSET(Data!A84,0,(View!$B$27-1)*12),\"\")","v":44474.392071759263},{"$f":"IF(OFFSET(Data!B84,0,(View!$B$27-1)*12)<>\"\",OFFSET(Data!B84,0,(View!$B$27-1)*12),\"\")","v":80},{"$f":"IF(OFFSET(Data!C84,0,(View!$B$27-1)*12)<>\"\",OFFSET(Data!C84,0,(View!$B$27-1)*12),\"\")","v":75.505799999999994},{"$f":"IF(OFFSET(Data!D84,0,(View!$B$27-1)*12)<>\"\",OFFSET(Data!D84,0,(View!$B$27-1)*12),\"\")","v":44.192050000000002},26254.575455167378,"OK",{"$f":"IF(OFFSET(Data!F84,0,(View!$B$27-1)*12)<>\"\",OFFSET(Data!F84,0,(View!$B$27-1)*12),IF($M81<>\"\",#N/A,\"\"))","v":77.168660000000003},{"$f":"IF(OFFSET(Data!G84,0,(View!$B$27-1)*12)<>\"\",OFFSET(Data!G84,0,(View!$B$27-1)*12),IF($N81<>\"\",#N/A,\"\"))","v":59.491709999999998},"OK",{"$f":"IF(OFFSET(Data!I84,0,(View!$B$27-1)*12)<>\"\",OFFSET(Data!I84,0,(View!$B$27-1)*12),IF($M81<>\"\",#N/A,\"\"))","v":77.738050000000001},{"$f":"IF(OFFSET(Data!J84,0,(View!$B$27-1)*12)<>\"\",OFFSET(Data!J84,0,(View!$B$27-1)*12),IF($N81<>\"\",#N/A,\"\"))","v":65.886600000000001},"OK"]
[null,null,null,null,null,null,null,null,null,null,{"$f":"IF(OFFSET(Data!A85,0,(View!$B$27-1)*12)<>\"\",$B$3 + OFFSET(Data!A85,0,(View!$B$27-1)*12),\"\")","v":44474.392083333332},{"$f":"IF(OFFSET(Data!B85,0,(View!$B$27-1)*12)<>\"\",OFFSET(Data!B85,0,(View!$B$27-1)*12),\"\")","v":81},{"$f":"IF(OFFSET(Data!C85,0,(View!$B$27-1)*12)<>\"\",OFFSET(Data!C85,0,(View!$B$27-1)*12),\"\")","v":75.461590000000001},{"$f":"IF(OFFSET(Data!D85,0,(View!$B$27-1)*12)<>\"\",OFFSET(Data!D85,0,(View!$B$27-1)*12),\"\")","v":68.04674},6377845.5811266312,"OK",{"$f":"IF(OFFSET(Data!F85,0,(View!$B$27-1)*12)<>\"\",OFFSET(Data!F85,0,(View!$B$27-1)*12),IF($M82<>\"\",#N/A,\"\"))","v":77.134190000000004},{"$f":"IF(OFFSET(Data!G85,0,(View!$B$27-1)*12)<>\"\",OFFSET(Data!G85,0,(View!$B$27-1)*12),IF($N82<>\"\",#N/A,\"\"))","v":72.729150000000004},"OK",{"$f":"IF(OFFSET(Data!I85,0,(View!$B$27-1)*12)<>\"\",OFFSET(Data!I85,0,(View!$B$27-1)*12),IF($M82<>\"\",#N/A,\"\"))","v":77.702100000000002},{"$f":"IF(OFFSET(Data!J85,0,(View!$B$27-1)*12)<>\"\",OFFSET(Data!J85,0,(View!$B$27-1)*12),IF($N82<>\"\",#N/A,\"\"))","v":72.950760000000002},"OK"]
[null,null,null,null,null,null,null,null,null,null,{"$f":"IF(OFFSET(Data!A86,0,(View!$B$27-1)*12)<>\"\",$B$3 + OFFSET(Data!A86,0,(View!$B$27-1)*12),\"\")","v":44474.392094907409},{"$f":"IF(OFFSET(Data!B86,0,(View!$B$27-1)*12)<>\"\",OFFSET(Data!B86,0,(View!$B$27-1)*12),\"\")","v":82},{"$f":"IF(OFFSET(Data!C86,0,(View!$B$27-1)*12)<>\"\",OFFSET(Data!C86,0,(View!$B$27-1)*12),\"\")","v":75.444559999999996},{"$f":"IF(OFFSET(Data!D86,0,(View!$B$27-1)*12)<>\"\",OFFSET(Data!D86,0,(View!$B$27-1)*12),\"\")","v":73.781850000000006},23888286.552400425,"OK",{"$f":"IF(OFFSET(Data!F86,0,(View!$B$27-1)*12)<>\"\",OFFSET(Data!F86,0,(View!$B$27-1)*12),IF($M83<>\"\",#N/A,\"\"))","v":77.120369999999994},{"$f":"IF(OFFSET(Data!G86,0,(View!$B$27-1)*12)<>\"\",OFFSET(Data!G86,0,(View!$B$27-1)*12),IF($N83<>\"\",#N/A,\"\"))","v":75.822940000000003},"OK",{"$f":"IF(OFFSET(Data!I86,0,(View!$B$27-1)*12)<>\"\",OFFSET(Data!I86,0,(View!$B$27-1)*12),IF($M83<>\"\",#N/A,\"\"))","v":77.68432},{"$f":"IF(OFFSET(Data!J86,0,(View!$B$27-1)*12)<>\"\",OFFSET(Data!J86,0,(View!$B$27-1)*12),IF($N83<>\"\",#N/A,\"\"))","v":75.931100000000001},"OK"]
[null,null,null,null,null,null,null,null,null,null,{"$f":"IF(OFFSET(Data!A87,0,(View!$B$27-1)*12)<>\"\",$B$3 + OFFSET(Data!A87,0,(View!$B$27-1)*12),\"\")","v":44474.392106481479},{"$f":"IF(OFFSET(Data!B87,0,(View!$B$27-1)*12)<>\"\",OFFSET(Data!B87,0,(View!$B$27-1)*12),\"\")","v":83},{"$f":"IF(OFFSET(Data!C87,0,(View!$B$27-1)*12)<>\"\",OFFSET(Data!C87,0,(View!$B$27-1)*12),\"\")","v":75.414540000000002},{"$f":"IF(OFFSET(Data!D87,0,(View!$B$27-1)*12)<>\"\",OFFSET(Data!D87,0,(View!$B$27-1)*12),\"\")","v":71.759450000000001},14994949.241709683,"OK",{"$f":"IF(OFFSET(Data!F87,0,(View!$B$27-1)*12)<>\"\",OFFSET(Data!F87,0,(View!$B$27-1)*12),IF($M84<>\"\",#N/A,\"\"))","v":77.094800000000006},{"$f":"IF(OFFSET(Data!G87,0,(View!$B$27-1)*12)<>\"\",OFFSET(Data!G87,0,(View!$B$27-1)*12),IF($N84<>\"\",#N/A,\"\"))","v":74.21987},"OK",{"$f":"IF(OFFSET(Data!I87,0,(View!$B$27-1)*12)<>\"\",OFFSET(Data!I87,0,(View!$B$27-1)*12),IF($M84<>\"\",#N/A,\"\"))","v":77.65625},{"$f":"IF(OFFSET(Data!J87,0,(View!$B$27-1)*12)<>\"\",OFFSET(Data!J87,0,(View!$B$27-1)*12),IF($N84<>\"\",#N/A,\"\"))","v":74.361660000000001},"OK"]
[null,null,null,null,null,null,null,null,null,null,{"$f":"IF(OFFSET(Data!A88,0,(View!$B$27-1)*12)<>\"\",$B$3 + OFFSET(Data!A88,0,(View!$B$27-1)*12),\"\")","v":44474.392118055555},{"$f":"IF(OFFSET(Data!B88,0,(View!$B$27-1)*12)<>\"\",OFFSET(Data!B88,0,(View!$B$27-1)*12),\"\")","v":84},{"$f":"IF(OFFSET(Data!C88,0,(View!$B$27-1)*12)<>\"\",OFFSET(Data!C88,0,(View!$B$27-1)*12),\"\")","v":75.377930000000006},{"$f":"IF(OFFSET(Data!D88,0,(View!$B$27-1)*12)<>\"\",OFFSET(Data!D88,0,(View!$B$27-1)*12),\"\")","v":70.112650000000002},10262779.547001231,"OK",{"$f":"IF(OFFSET(Data!F88,0,(View!$B$27-1)*12)<>\"\",OFFSET(Data!F88,0,(View!$B$27-1)*12),IF($M85<>\"\",#N/A,\"\"))","v":77.057950000000005},{"$f":"IF(OFFSET(Data!G88,0,(View!$B$27-1)*12)<>\"\",OFFSET(Data!G88,0,(View!$B$27-1)*12),IF($N85<>\"\",#N/A,\"\"))","v":71.722669999999994},"OK",{"$f":"IF(OFFSET(Data!I88,0,(View!$B$27-1)*12)<>\"\",OFFSET(Data!I88,0,(View!$B$27-1)*12),IF($M85<>\"\",#N/A,\"\"))","v":77.618210000000005},{"$f":"IF(OFFSET(Data!J88,0,(View!$B$27-1)*12)<>\"\",OFFSET(Data!J88,0,(View!$B$27-1)*12),IF($N85<>\"\",#N/A,\"\"))","v":71.927430000000001},"OK"]
[null,null,null,null,null,null,null,null,null,null,{"$f":"IF(OFFSET(Data!A89,0,(View!$B$27-1)*12)<>\"\",$B$3 + OFFSET(Data!A89,0,(View!$B$27-1)*12),\"\")","v":44474.392129629632},{"$f":"IF(OFFSET(Data!B89,0,(View!$B$27-1)*12)<>\"\",OFFSET(Data!B89,0,(View!$B$27-1)*12),\"\")","v":85},{"$f":"IF(OFFSET(Data!C89,0,(View!$B$27-1)*12)<>\"\",OFFSET(Data!C89,0,(View!$B$27-1)*12),\"\")","v":75.326930000000004},{"$f":"IF(OFFSET(Data!D89,0,(View!$B$27-1)*12)<>\"\",OFFSET(Data!D89,0,(View!$B$27-1)*12),\"\")","v":54.182169999999999},261949.15389515329,"OK",{"$f":"IF(OFFSET(Data!F89,0,(View!$B$27-1)*12)<>\"\",OFFSET(Data!F89,0,(View!$B$27-1)*12),IF($M86<>\"\",#N/A,\"\"))","v":77.008759999999995},{"$f":"IF(OFFSET(Data!G89,0,(View!$B$27-1)*12)<>\"\",OFFSET(Data!G89,0,(View!$B$27-1)*12),IF($N86<>\"\",#N/A,\"\"))","v":63.365119999999997},"OK",{"$f":"IF(OFFSET(Data!I89,0,(View!$B$27-1)*12)<>\"\",OFFSET(Data!I89,0,(View!$B$27-1)*12),IF($M86<>\"\",#N/A,\"\"))","v":77.569630000000004},{"$f":"IF(OFFSET(Data!J89,0,(View!$B$27-1)*12)<>\"\",OFFSET(Data!J89,0,(View!$B$27-1)*12),IF($N86<>\"\",#N/A,\"\"))","v":64.970209999999994},"OK"]
[null,null,null,null,null,null,null,null,null,null,{"$f":"IF(OFFSET(Data!A90,0,(View!$B$27-1)*12)<>\"\",$B$3 + OFFSET(Data!A90,0,(View!$B$27-1)*12),\"\")","v":44474.392141203702},{"$f":"IF(OFFSET(Data!B90,0,(View!$B$27-1)*12)<>\"\",OFFSET(Data!B90,0,(View!$B$27-1)*12),\"\")","v":86},{"$f":"IF(OFFSET(Data!C90,0,(View!$B$27-1)*12)<>\"\",OFFSET(Data!C90,0,(View!$B$27-1)*12),\"\")","v":75.289860000000004},{"$f":"IF(OFFSET(Data!D90,0,(View!$B$27-1)*12)<>\"\",OFFSET(Data!D90,0,(View!$B$27-1)*12),\"\")","v":69.628460000000004},9180070.1521439776,"OK",{"$f":"IF(OFFSET(Data!F90,0,(View!$B$27-1)*12)<>\"\",OFFSET(Data!F90,0,(View!$B$27-1)*12),IF($M87<>\"\",#N/A,\"\"))","v":76.983699999999999},{"$f":"IF(OFFSET(Data!G90,0,(View!$B$27-1)*12)<>\"\",OFFSET(Data!G90,0,(View!$B$27-1)*12),IF($N87<>\"\",#N/A,\"\"))","v":74.043819999999997},"OK",{"$f":"IF(OFFSET(Data!I90,0,(View!$B$27-1)*12)<>\"\",OFFSET(Data!I90,0,(View!$B$27-1)*12),IF($M87<>\"\",#N/A,\"\"))","v":77.542379999999994},{"$f":"IF(OFFSET(Data!J90,0,(View!$B$27-1)*12)<>\"\",OFFSET(Data!J90,0,(View!$B$27-1)*12),IF($N87<>\"\",#N/A,\"\"))","v":74.218149999999994},"OK"]
[null,null,null,null,null,null,null,null,null,null,{"$f":"IF(OFFSET(Data!A91,0,(View!$B$27-1)*12)<>\"\",$B$3 + OFFSET(Data!A91,0,(View!$B$27-1)*12),\"\")","v":44474.392152777778},{"$f":"IF(OFFSET(Data!B91,0,(View!$B$27-1)*12)<>\"\",OFFSET(Data!B91,0,(View!$B$27-1)*12),\"\")","v":87},{"$f":"IF(OFFSET(Data!C91,0,(View!$B$27-1)*12)<>\"\",OFFSET(Data!C91,0,(View!$B$27-1)*12),\"\")","v":75.245800000000003},{"$f":"IF(OFFSET(Data!D91,0,(View!$B$27-1)*12)<>\"\",OFFSET(Data!D91,0,(View!$B$27-1)*12),\"\")","v":66.149050000000003},4120073.844435575,"OK",{"$f":"IF(OFFSET(Data!F91,0,(View!$B$27-1)*12)<>\"\",OFFSET(Data!F91,0,(View!$B$27-1)*12),IF($M88<>\"\",#N/A,\"\"))","v":76.945490000000007},{"$f":"IF(OFFSET(Data!G91,0,(View!$B$27-1)*12)<>\"\",OFFSET(Data!G91,0,(View!$B$27-1)*12),IF($N88<>\"\",#N/A,\"\"))","v":70.746120000000005},"OK",{"$f":"IF(OFFSET(Data!I91,0,(View!$B$27-1)*12)<>\"\",OFFSET(Data!I91,0,(View!$B$27-1)*12),IF($M88<>\"\",#N/A,\"\"))","v":77.503619999999998},{"$f":"IF(OFFSET(Data!J91,0,(View!$B$27-1)*12)<>\"\",OFFSET(Data!J91,0,(View!$B$27-1)*12),IF($N88<>\"\",#N/A,\"\"))","v":71.105140000000006},"OK"]
[null,null,null,null,null,null,null,null,null,null,{"$f":"IF(OFFSET(Data!A92,0,(View!$B$27-1)*12)<>\"\",$B$3 + OFFSET(Data!A92,0,(View!$B$27-1)*12),\"\")","v":44474.392164351855},{"$f":"IF(OFFSET(Data!B92,0,(View!$B$27-1)*12)<>\"\",OFFSET(Data!B92,0,(View!$B$27-1)*12),\"\")","v":88},{"$f":"IF(OFFSET(Data!C92,0,(View!$B$27-1)*12)<>\"\",OFFSET(Data!C92,0,(View!$B$27-1)*12),\"\")","v":75.205020000000005},{"$f":"IF(OFFSET(Data!D92,0,(View!$B$27-1)*12)<>\"\",OFFSET(Data!D92,0,(View!$B$27-1)*12),\"\")","v":67.73254},5932722.0230444139,"OK",{"$f":"IF(OFFSET(Data!F92,0,(View!$B$27-1)*12)<>\"\",OFFSET(Data!F92,0,(View!$B$27-1)*12),IF($M89<>\"\",#N/A,\"\"))","v":76.909930000000003},{"$f":"IF(OFFSET(Data!G92,0,(View!$B$27-1)*12)<>\"\",OFFSET(Data!G92,0,(View!$B$27-1)*12),IF($N89<>\"\",#N/A,\"\"))","v":71.454070000000002},"OK",{"$f":"IF(OFFSET(Data!I92,0,(View!$B$27-1)*12)<>\"\",OFFSET(Data!I92,0,(View!$B$27-1)*12),IF($M89<>\"\",#N/A,\"\"))","v":77.466989999999996},{"$f":"IF(OFFSET(Data!J92,0,(View!$B$27-1)*12)<>\"\",OFFSET(Data!J92,0,(View!$B$27-1)*12),IF($N89<>\"\",#N/A,\"\"))","v":71.664829999999995},"OK"]
[null,null,null,null,null,null,null,null,null,null,{"$f":"IF(OFFSET(Data!A93,0,(View!$B$27-1)*12)<>\"\",$B$3 + OFFSET(Data!A93,0,(View!$B$27-1)*12),\"\")","v":44474.392175925925},{"$f":"IF(OFFSET(Data!B93,0,(View!$B$27-1)*12)<>\"\",OFFSET(Data!B93,0,(View!$B$27-1)*12),\"\")","v":89},{"$f":"IF(OFFSET(Data!C93,0,(View!$B$27-1)*12)<>\"\",OFFSET(Data!C93,0,(View!$B$27-1)*12),\"\")","v":75.156909999999996},{"$f":"IF(OFFSET(Data!D93,0,(View!$B$27-1)*12)<>\"\",OFFSET(Data!D93,0,(View!$B$27-1)*12),\"\")","v":58.165080000000003},655402.35867989191,"OK",{"$f":"IF(OFFSET(Data!F93,0,(View!$B$27-1)*12)<>\"\",OFFSET(Data!F93,0,(View!$B$27-1)*12),IF($M90<>\"\",#N/A,\"\"))","v":76.863380000000006},{"$f":"IF(OFFSET(Data!G93,0,(View!$B$27-1)*12)<>\"\",OFFSET(Data!G93,0,(View!$B$27-1)*12),IF($N90<>\"\",#N/A,\"\"))","v":64.001890000000003},"OK",{"$f":"IF(OFFSET(Data!I93,0,(View!$B$27-1)*12)<>\"\",OFFSET(Data!I93,0,(View!$B$27-1)*12),IF($M90<>\"\",#N/A,\"\"))","v":77.420829999999995},{"$f":"IF(OFFSET(Data!J93,0,(View!$B$27-1)*12)<>\"\",OFFSET(Data!J93,0,(View!$B$27-1)*12),IF($N90<>\"\",#N/A,\"\"))","v":65.181039999999996},"OK"]
[null,null,null,null,null,null,null,null,null,null,{"$f":"IF(OFFSET(Data!A94,0,(View!$B$27-1)*12)<>\"\",$B$3 + OFFSET(Data!A94,0,(View!$B$27-1)*12),\"\")","v":44474.392187500001},{"$f":"IF(OFFSET(Data!B94,0,(View!$B$27-1)*12)<>\"\",OFFSET(Data!B94,0,(View!$B$27-1)*12),\"\")","v":90},{"$f":"IF(OFFSET(Data!C94,0,(View!$B$27-1)*12)<>\"\",OFFSET(Data!C94,0,(View!$B$27-1)*12),\"\")","v":75.161640000000006},{"$f":"IF(OFFSET(Data!D94,0,(View!$B$27-1)*12)<>\"\",OFFSET(Data!D94,0,(View!$B$27-1)*12),\"\")","v":75.562989999999999},35999709.811845183,"OK",{"$f":"IF(OFFSET(Data!F94,0,(View!$B$27-1)*12)<>\"\",OFFSET(Data!F94,0,(View!$B$27-1)*12),IF($M91<>\"\",#N/A,\"\"))","v":76.87773},{"$f":"IF(OFFSET(Data!G94,0,(View!$B$27-1)*12)<>\"\",OFFSET(Data!G94,0,(View!$B$27-1)*12),IF($N91<>\"\",#N/A,\"\"))","v":77.995599999999996},"OK",{"$f":"IF(OFFSET(Data!I94,0,(View!$B$27-1)*12)<>\"\",OFFSET(Data!I94,0,(View!$B$27-1)*12),IF($M91<>\"\",#N/A,\"\"))","v":77.428169999999994},{"$f":"IF(OFFSET(Data!J94,0,(View!$B$27-1)*12)<>\"\",OFFSET(Data!J94,0,(View!$B$27-1)*12),IF($N91<>\"\",#N/A,\"\"))","v":78.036659999999998},"OK"]
[null,null,null,null,null,null,null,null,null,null,{"$f":"IF(OFFSET(Data!A95,0,(View!$B$27-1)*12)<>\"\",$B$3 + OFFSET(Data!A95,0,(View!$B$27-1)*12),\"\")","v":44474.392199074071},{"$f":"IF(OFFSET(Data!B95,0,(View!$B$27-1)*12)<>\"\",OFFSET(Data!B95,0,(View!$B$27-1)*12),\"\")","v":91},{"$f":"IF(OFFSET(Data!C95,0,(View!$B$27-1)*12)<>\"\",OFFSET(Data!C95,0,(View!$B$27-1)*12),\"\")","v":75.130709999999993},{"$f":"IF(OFFSET(Data!D95,0,(View!$B$27-1)*12)<>\"\",OFFSET(Data!D95,0,(View!$B$27-1)*12),\"\")","v":70.652630000000002},11621521.767621828,"OK",{"$f":"IF(OFFSET(Data!F95,0,(View!$B$27-1)*12)<>\"\",OFFSET(Data!F95,0,(View!$B$27-1)*12),IF($M92<>\"\",#N/A,\"\"))","v":76.849450000000004},{"$f":"IF(OFFSET(Data!G95,0,(View!$B$27-1)*12)<>\"\",OFFSET(Data!G95,0,(View!$B$27-1)*12),IF($N92<>\"\",#N/A,\"\"))","v":72.999179999999996},"OK",{"$f":"IF(OFFSET(Data!I95,0,(View!$B$27-1)*12)<>\"\",OFFSET(Data!I95,0,(View!$B$27-1)*12),IF($M92<>\"\",#N/A,\"\"))","v":77.398210000000006},{"$f":"IF(OFFSET(Data!J95,0,(View!$B$27-1)*12)<>\"\",OFFSET(Data!J95,0,(View!$B$27-1)*12),IF($N92<>\"\",#N/A,\"\"))","v":73.160659999999993},"OK"]
[null,null,null,null,null,null,null,null,null,null,{"$f":"IF(OFFSET(Data!A96,0,(View!$B$27-1)*12)<>\"\",$B$3 + OFFSET(Data!A96,0,(View!$B$27-1)*12),\"\")","v":44474.392210648148},{"$f":"IF(OFFSET(Data!B96,0,(View!$B$27-1)*12)<>\"\",OFFSET(Data!B96,0,(View!$B$27-1)*12),\"\")","v":92},{"$f":"IF(OFFSET(Data!C96,0,(View!$B$27-1)*12)<>\"\",OFFSET(Data!C96,0,(View!$B$27-1)*12),\"\")","v":75.100880000000004},{"$f":"IF(OFFSET(Data!D96,0,(View!$B$27-1)*12)<>\"\",OFFSET(Data!D96,0,(View!$B$27-1)*12),\"\")","v":70.814959999999999},12064129.766716886,"OK",{"$f":"IF(OFFSET(Data!F96,0,(View!$B$27-1)*12)<>\"\",OFFSET(Data!F96,0,(View!$B$27-1)*12),IF($M93<>\"\",#N/A,\"\"))","v":76.830370000000002},{"$f":"IF(OFFSET(Data!G96,0,(View!$B$27-1)*12)<>\"\",OFFSET(Data!G96,0,(View!$B$27-1)*12),IF($N93<>\"\",#N/A,\"\"))","v":74.606160000000003},"OK",{"$f":"IF(OFFSET(Data!I96,0,(View!$B$27-1)*12)<>\"\",OFFSET(Data!I96,0,(View!$B$27-1)*12),IF($M93<>\"\",#N/A,\"\"))","v":77.376800000000003},{"$f":"IF(OFFSET(Data!J96,0,(View!$B$27-1)*12)<>\"\",OFFSET(Data!J96,0,(View!$B$27-1)*12),IF($N93<>\"\",#N/A,\"\"))","v":74.783299999999997},"OK"]
[null,null,null,null,null,null,null,null,null,null,{"$f":"IF(OFFSET(Data!A97,0,(View!$B$27-1)*12)<>\"\",$B$3 + OFFSET(Data!A97,0,(View!$B$27-1)*12),\"\")","v":44474.392222222225},{"$f":"IF(OFFSET(Data!B97,0,(View!$B$27-1)*12)<>\"\",OFFSET(Data!B97,0,(View!$B$27-1)*12),\"\")","v":93},{"$f":"IF(OFFSET(Data!C97,0,(View!$B$27-1)*12)<>\"\",OFFSET(Data!C97,0,(View!$B$27-1)*12),\"\")","v":75.057980000000001},{"$f":"IF(OFFSET(Data!D97,0,(View!$B$27-1)*12)<>\"\",OFFSET(Data!D97,0,(View!$B$27-1)*12),\"\")","v":64.437100000000001},2777857.7347074295,"OK",{"$f":"IF(OFFSET(Data!F97,0,(View!$B$27-1)*12)<>\"\",OFFSET(Data!F97,0,(View!$B$27-1)*12),IF($M94<>\"\",#N/A,\"\"))","v":76.790459999999996},{"$f":"IF(OFFSET(Data!G97,0,(View!$B$27-1)*12)<>\"\",OFFSET(Data!G97,0,(View!$B$27-1)*12),IF($N94<>\"\",#N/A,\"\"))","v":68.572180000000003},"OK",{"$f":"IF(OFFSET(Data!I97,0,(View!$B$27-1)*12)<>\"\",OFFSET(Data!I97,0,(View!$B$27-1)*12),IF($M94<>\"\",#N/A,\"\"))","v":77.336849999999998},{"$f":"IF(OFFSET(Data!J97,0,(View!$B$27-1)*12)<>\"\",OFFSET(Data!J97,0,(View!$B$27-1)*12),IF($N94<>\"\",#N/A,\"\"))","v":69.087689999999995},"OK"]
[null,null,null,null,null,null,null,null,null,null,{"$f":"IF(OFFSET(Data!A98,0,(View!$B$27-1)*12)<>\"\",$B$3 + OFFSET(Data!A98,0,(View!$B$27-1)*12),\"\")","v":44474.392233796294},{"$f":"IF(OFFSET(Data!B98,0,(View!$B$27-1)*12)<>\"\",OFFSET(Data!B98,0,(View!$B$27-1)*12),\"\")","v":94},{"$f":"IF(OFFSET(Data!C98,0,(View!$B$27-1)*12)<>\"\",OFFSET(Data!C98,0,(View!$B$27-1)*12),\"\")","v":75.011750000000006},{"$f":"IF(OFFSET(Data!D98,0,(View!$B$27-1)*12)<>\"\",OFFSET(Data!D98,0,(View!$B$27-1)*12),\"\")","v":51.964359999999999},157194.01257358876,"OK",{"$f":"IF(OFFSET(Data!F98,0,(View!$B$27-1)*12)<>\"\",OFFSET(Data!F98,0,(View!$B$27-1)*12),IF($M95<>\"\",#N/A,\"\"))","v":76.745729999999995},{"$f":"IF(OFFSET(Data!G98,0,(View!$B$27-1)*12)<>\"\",OFFSET(Data!G98,0,(View!$B$27-1)*12),IF($N95<>\"\",#N/A,\"\"))","v":62.442259999999997},"OK",{"$f":"IF(OFFSET(Data!I98,0,(View!$B$27-1)*12)<>\"\",OFFSET(Data!I98,0,(View!$B$27-1)*12),IF($M95<>\"\",#N/A,\"\"))","v":77.292689999999993},{"$f":"IF(OFFSET(Data!J98,0,(View!$B$27-1)*12)<>\"\",OFFSET(Data!J98,0,(View!$B$27-1)*12),IF($N95<>\"\",#N/A,\"\"))","v":64.246380000000002},"OK"]
[null,null,null,null,null,null,null,null,null,null,{"$f":"IF(OFFSET(Data!A99,0,(View!$B$27-1)*12)<>\"\",$B$3 + OFFSET(Data!A99,0,(View!$B$27-1)*12),\"\")","v":44474.392245370371},{"$f":"IF(OFFSET(Data!B99,0,(View!$B$27-1)*12)<>\"\",OFFSET(Data!B99,0,(View!$B$27-1)*12),\"\")","v":95},{"$f":"IF(OFFSET(Data!C99,0,(View!$B$27-1)*12)<>\"\",OFFSET(Data!C99,0,(View!$B$27-1)*12),\"\")","v":74.967439999999996},{"$f":"IF(OFFSET(Data!D99,0,(View!$B$27-1)*12)<>\"\",OFFSET(Data!D99,0,(View!$B$27-1)*12),\"\")","v":60.516330000000004},1126245.321754348,"OK",{"$f":"IF(OFFSET(Data!F99,0,(View!$B$27-1)*12)<>\"\",OFFSET(Data!F99,0,(View!$B$27-1)*12),IF($M96<>\"\",#N/A,\"\"))","v":76.703670000000002},{"$f":"IF(OFFSET(Data!G99,0,(View!$B$27-1)*12)<>\"\",OFFSET(Data!G99,0,(View!$B$27-1)*12),IF($N96<>\"\",#N/A,\"\"))","v":66.006150000000005},"OK",{"$f":"IF(OFFSET(Data!I99,0,(View!$B$27-1)*12)<>\"\",OFFSET(Data!I99,0,(View!$B$27-1)*12),IF($M96<>\"\",#N/A,\"\"))","v":77.251050000000006},{"$f":"IF(OFFSET(Data!J99,0,(View!$B$27-1)*12)<>\"\",OFFSET(Data!J99,0,(View!$B$27-1)*12),IF($N96<>\"\",#N/A,\"\"))","v":67.001140000000007},"OK"]
[null,null,null,null,null,null,null,null,null,null,{"$f":"IF(OFFSET(Data!A100,0,(View!$B$27-1)*12)<>\"\",$B$3 + OFFSET(Data!A100,0,(View!$B$27-1)*12),\"\")","v":44474.392256944448},{"$f":"IF(OFFSET(Data!B100,0,(View!$B$27-1)*12)<>\"\",OFFSET(Data!B100,0,(View!$B$27-1)*12),\"\")","v":96},{"$f":"IF(OFFSET(Data!C100,0,(View!$B$27-1)*12)<>\"\",OFFSET(Data!C100,0,(View!$B$27-1)*12),\"\")","v":74.922659999999993},{"$f":"IF(OFFSET(Data!D100,0,(View!$B$27-1)*12)<>\"\",OFFSET(Data!D100,0,(View!$B$27-1)*12),\"\")","v":56.831110000000002},482070.99293341395,"OK",{"$f":"IF(OFFSET(Data!F100,0,(View!$B$27-1)*12)<>\"\",OFFSET(Data!F100,0,(View!$B$27-1)*12),IF($M97<>\"\",#N/A,\"\"))","v":76.661929999999998},{"$f":"IF(OFFSET(Data!G100,0,(View!$B$27-1)*12)<>\"\",OFFSET(Data!G100,0,(View!$B$27-1)*12),IF($N97<>\"\",#N/A,\"\"))","v":65.840239999999994},"OK",{"$f":"IF(OFFSET(Data!I100,0,(View!$B$27-1)*12)<>\"\",OFFSET(Data!I100,0,(View!$B$27-1)*12),IF($M97<>\"\",#N/A,\"\"))","v":77.209500000000006},{"$f":"IF(OFFSET(Data!J100,0,(View!$B$27-1)*12)<>\"\",OFFSET(Data!J100,0,(View!$B$27-1)*12),IF($N97<>\"\",#N/A,\"\"))","v":66.588920000000002},"OK"]
[null,null,null,null,null,null,null,null,null,null,{"$f":"IF(OFFSET(Data!A101,0,(View!$B$27-1)*12)<>\"\",$B$3 + OFFSET(Data!A101,0,(View!$B$27-1)*12),\"\")","v":44474.392268518517},{"$f":"IF(OFFSET(Data!B101,0,(View!$B$27-1)*12)<>\"\",OFFSET(Data!B101,0,(View!$B$27-1)*12),\"\")","v":97},{"$f":"IF(OFFSET(Data!C101,0,(View!$B$27-1)*12)<>\"\",OFFSET(Data!C101,0,(View!$B$27-1)*12),\"\")","v":74.882750000000001},{"$f":"IF(OFFSET(Data!D101,0,(View!$B$27-1)*12)<>\"\",OFFSET(Data!D101,0,(View!$B$27-1)*12),\"\")","v":65.439899999999994},3499371.0933587556,"OK",{"$f":"IF(OFFSET(Data!F101,0,(View!$B$27-1)*12)<>\"\",OFFSET(Data!F101,0,(View!$B$27-1)*12),IF($M98<>\"\",#N/A,\"\"))","v":76.628200000000007},{"$f":"IF(OFFSET(Data!G101,0,(View!$B$27-1)*12)<>\"\",OFFSET(Data!G101,0,(View!$B$27-1)*12),IF($N98<>\"\",#N/A,\"\"))","v":70.635170000000002},"OK",{"$f":"IF(OFFSET(Data!I101,0,(View!$B$27-1)*12)<>\"\",OFFSET(Data!I101,0,(View!$B$27-1)*12),IF($M98<>\"\",#N/A,\"\"))","v":77.17653},{"$f":"IF(OFFSET(Data!J101,0,(View!$B$27-1)*12)<>\"\",OFFSET(Data!J101,0,(View!$B$27-1)*12),IF($N98<>\"\",#N/A,\"\"))","v":71.465770000000006},"OK"]
[null,null,null,null,null,null,null,null,null,null,{"$f":"IF(OFFSET(Data!A102,0,(View!$B$27-1)*12)<>\"\",$B$3 + OFFSET(Data!A102,0,(View!$B$27-1)*12),\"\")","v":44474.392280092594},{"$f":"IF(OFFSET(Data!B102,0,(View!$B$27-1)*12)<>\"\",OFFSET(Data!B102,0,(View!$B$27-1)*12),\"\")","v":98},{"$f":"IF(OFFSET(Data!C102,0,(View!$B$27-1)*12)<>\"\",OFFSET(Data!C102,0,(View!$B$27-1)*12),\"\")","v":74.870249999999999},{"$f":"IF(OFFSET(Data!D102,0,(View!$B$27-1)*12)<>\"\",OFFSET(Data!D102,0,(View!$B$27-1)*12),\"\")","v":73.446370000000002},22112456.929366026,"OK",{"$f":"IF(OFFSET(Data!F102,0,(View!$B$27-1)*12)<>\"\",OFFSET(Data!F102,0,(View!$B$27-1)*12),IF($M99<>\"\",#N/A,\"\"))","v":76.620459999999994},{"$f":"IF(OFFSET(Data!G102,0,(View!$B$27-1)*12)<>\"\",OFFSET(Data!G102,0,(View!$B$27-1)*12),IF($N99<>\"\",#N/A,\"\"))","v":75.794820000000001},"OK",{"$f":"IF(OFFSET(Data!I102,0,(View!$B$27-1)*12)<>\"\",OFFSET(Data!I102,0,(View!$B$27-1)*12),IF($M99<>\"\",#N/A,\"\"))","v":77.165570000000002},{"$f":"IF(OFFSET(Data!J102,0,(View!$B$27-1)*12)<>\"\",OFFSET(Data!J102,0,(View!$B$27-1)*12),IF($N99<>\"\",#N/A,\"\"))","v":75.944559999999996},"OK"]
[null,null,null,null,null,null,null,null,null,null,{"$f":"IF(OFFSET(Data!A103,0,(View!$B$27-1)*12)<>\"\",$B$3 + OFFSET(Data!A103,0,(View!$B$27-1)*12),\"\")","v":44474.392291666663},{"$f":"IF(OFFSET(Data!B103,0,(View!$B$27-1)*12)<>\"\",OFFSET(Data!B103,0,(View!$B$27-1)*12),\"\")","v":99},{"$f":"IF(OFFSET(Data!C103,0,(View!$B$27-1)*12)<>\"\",OFFSET(Data!C103,0,(View!$B$27-1)*12),\"\")","v":74.87585},{"$f":"IF(OFFSET(Data!D103,0,(View!$B$27-1)*12)<>\"\",OFFSET(Data!D103,0,(View!$B$27-1)*12),\"\")","v":75.392520000000005},34614016.789817788,"OK",{"$f":"IF(OFFSET(Data!F103,0,(View!$B$27-1)*12)<>\"\",OFFSET(Data!F103,0,(View!$B$27-1)*12),IF($M100<>\"\",#N/A,\"\"))","v":76.633960000000002},{"$f":"IF(OFFSET(Data!G103,0,(View!$B$27-1)*12)<>\"\",OFFSET(Data!G103,0,(View!$B$27-1)*12),IF($N100<>\"\",#N/A,\"\"))","v":77.787279999999996},"OK",{"$f":"IF(OFFSET(Data!I103,0,(View!$B$27-1)*12)<>\"\",OFFSET(Data!I103,0,(View!$B$27-1)*12),IF($M100<>\"\",#N/A,\"\"))","v":77.172619999999995},{"$f":"IF(OFFSET(Data!J103,0,(View!$B$27-1)*12)<>\"\",OFFSET(Data!J103,0,(View!$B$27-1)*12),IF($N100<>\"\",#N/A,\"\"))","v":77.813069999999996},"OK"]
[null,null,null,null,null,null,null,null,null,null,{"$f":"IF(OFFSET(Data!A104,0,(View!$B$27-1)*12)<>\"\",$B$3 + OFFSET(Data!A104,0,(View!$B$27-1)*12),\"\")","v":44474.39230324074},{"$f":"IF(OFFSET(Data!B104,0,(View!$B$27-1)*12)<>\"\",OFFSET(Data!B104,0,(View!$B$27-1)*12),\"\")","v":100},{"$f":"IF(OFFSET(Data!C104,0,(View!$B$27-1)*12)<>\"\",OFFSET(Data!C104,0,(View!$B$27-1)*12),\"\")","v":74.839579999999998},{"$f":"IF(OFFSET(Data!D104,0,(View!$B$27-1)*12)<>\"\",OFFSET(Data!D104,0,(View!$B$27-1)*12),\"\")","v":67.13449},5169505.4795017894,"OK",{"$f":"IF(OFFSET(Data!F104,0,(View!$B$27-1)*12)<>\"\",OFFSET(Data!F104,0,(View!$B$27-1)*12),IF($M101<>\"\",#N/A,\"\"))","v":76.603710000000007},{"$f":"IF(OFFSET(Data!G104,0,(View!$B$27-1)*12)<>\"\",OFFSET(Data!G104,0,(View!$B$27-1)*12),IF($N101<>\"\",#N/A,\"\"))","v":71.486509999999996},"OK",{"$f":"IF(OFFSET(Data!I104,0,(View!$B$27-1)*12)<>\"\",OFFSET(Data!I104,0,(View!$B$27-1)*12),IF($M101<>\"\",#N/A,\"\"))","v":77.142349999999993},{"$f":"IF(OFFSET(Data!J104,0,(View!$B$27-1)*12)<>\"\",OFFSET(Data!J104,0,(View!$B$27-1)*12),IF($N101<>\"\",#N/A,\"\"))","v":72.022440000000003},"OK"]
[null,null,null,null,null,null,null,null,null,null,{"$f":"IF(OFFSET(Data!A105,0,(View!$B$27-1)*12)<>\"\",$B$3 + OFFSET(Data!A105,0,(View!$B$27-1)*12),\"\")","v":44474.392314814817},{"$f":"IF(OFFSET(Data!B105,0,(View!$B$27-1)*12)<>\"\",OFFSET(Data!B105,0,(View!$B$27-1)*12),\"\")","v":101},{"$f":"IF(OFFSET(Data!C105,0,(View!$B$27-1)*12)<>\"\",OFFSET(Data!C105,0,(View!$B$27-1)*12),\"\")","v":74.801190000000005},{"$f":"IF(OFFSET(Data!D105,0,(View!$B$27-1)*12)<>\"\",OFFSET(Data!D105,0,(View!$B$27-1)*12),\"\")","v":65.296819999999997},3385961.3778665606,"OK",{"$f":"IF(OFFSET(Data!F105,0,(View!$B$27-1)*12)<>\"\",OFFSET(Data!F105,0,(View!$B$27-1)*12),IF($M102<>\"\",#N/A,\"\"))","v":76.571460000000002},{"$f":"IF(OFFSET(Data!G105,0,(View!$B$27-1)*12)<>\"\",OFFSET(Data!G105,0,(View!$B$27-1)*12),IF($N102<>\"\",#N/A,\"\"))","v":70.631500000000003},"OK",{"$f":"IF(OFFSET(Data!I105,0,(View!$B$27-1)*12)<>\"\",OFFSET(Data!I105,0,(View!$B$27-1)*12),IF($M102<>\"\",#N/A,\"\"))","v":77.110699999999994},{"$f":"IF(OFFSET(Data!J105,0,(View!$B$27-1)*12)<>\"\",OFFSET(Data!J105,0,(View!$B$27-1)*12),IF($N102<>\"\",#N/A,\"\"))","v":71.401809999999998},"OK"]
[null,null,null,null,null,null,null,null,null,null,{"$f":"IF(OFFSET(Data!A106,0,(View!$B$27-1)*12)<>\"\",$B$3 + OFFSET(Data!A106,0,(View!$B$27-1)*12),\"\")","v":44474.392326388886},{"$f":"IF(OFFSET(Data!B106,0,(View!$B$27-1)*12)<>\"\",OFFSET(Data!B106,0,(View!$B$27-1)*12),\"\")","v":102},{"$f":"IF(OFFSET(Data!C106,0,(View!$B$27-1)*12)<>\"\",OFFSET(Data!C106,0,(View!$B$27-1)*12),\"\")","v":74.758690000000001},{"$f":"IF(OFFSET(Data!D106,0,(View!$B$27-1)*12)<>\"\",OFFSET(Data!D106,0,(View!$B$27-1)*12),\"\")","v":53.10895},204594.99246747221,"OK",{"$f":"IF(OFFSET(Data!F106,0,(View!$B$27-1)*12)<>\"\",OFFSET(Data!F106,0,(View!$B$27-1)*12),IF($M103<>\"\",#N/A,\"\"))","v":76.530410000000003},{"$f":"IF(OFFSET(Data!G106,0,(View!$B$27-1)*12)<>\"\",OFFSET(Data!G106,0,(View!$B$27-1)*12),IF($N103<>\"\",#N/A,\"\"))","v":62.651919999999997},"OK",{"$f":"IF(OFFSET(Data!I106,0,(View!$B$27-1)*12)<>\"\",OFFSET(Data!I106,0,(View!$B$27-1)*12),IF($M103<>\"\",#N/A,\"\"))","v":77.071370000000002},{"$f":"IF(OFFSET(Data!J106,0,(View!$B$27-1)*12)<>\"\",OFFSET(Data!J106,0,(View!$B$27-1)*12),IF($N103<>\"\",#N/A,\"\"))","v":66.160420000000002},"OK"]
[null,null,null,null,null,null,null,null,null,null,{"$f":"IF(OFFSET(Data!A107,0,(View!$B$27-1)*12)<>\"\",$B$3 + OFFSET(Data!A107,0,(View!$B$27-1)*12),\"\")","v":44474.392337962963},{"$f":"IF(OFFSET(Data!B107,0,(View!$B$27-1)*12)<>\"\",OFFSET(Data!B107,0,(View!$B$27-1)*12),\"\")","v":103},{"$f":"IF(OFFSET(Data!C107,0,(View!$B$27-1)*12)<>\"\",OFFSET(Data!C107,0,(View!$B$27-1)*12),\"\")","v":74.731930000000006},{"$f":"IF(OFFSET(Data!D107,0,(View!$B$27-1)*12)<>\"\",OFFSET(Data!D107,0,(View!$B$27-1)*12),\"\")","v":70.408100000000005},10985251.392432673,"OK",{"$f":"IF(OFFSET(Data!F107,0,(View!$B$27-1)*12)<>\"\",OFFSET(Data!F107,0,(View!$B$27-1)*12),IF($M104<>\"\",#N/A,\"\"))","v":76.504800000000003},{"$f":"IF(OFFSET(Data!G107,0,(View!$B$27-1)*12)<>\"\",OFFSET(Data!G107,0,(View!$B$27-1)*12),IF($N104<>\"\",#N/A,\"\"))","v":72.490380000000002},"OK",{"$f":"IF(OFFSET(Data!I107,0,(View!$B$27-1)*12)<>\"\",OFFSET(Data!I107,0,(View!$B$27-1)*12),IF($M104<>\"\",#N/A,\"\"))","v":77.04495},{"$f":"IF(OFFSET(Data!J107,0,(View!$B$27-1)*12)<>\"\",OFFSET(Data!J107,0,(View!$B$27-1)*12),IF($N104<>\"\",#N/A,\"\"))","v":72.815870000000004},"OK"]
[null,null,null,null,null,null,null,null,null,null,{"$f":"IF(OFFSET(Data!A108,0,(View!$B$27-1)*12)<>\"\",$B$3 + OFFSET(Data!A108,0,(View!$B$27-1)*12),\"\")","v":44474.39234953704},{"$f":"IF(OFFSET(Data!B108,0,(View!$B$27-1)*12)<>\"\",OFFSET(Data!B108,0,(View!$B$27-1)*12),\"\")","v":104},{"$f":"IF(OFFSET(Data!C108,0,(View!$B$27-1)*12)<>\"\",OFFSET(Data!C108,0,(View!$B$27-1)*12),\"\")","v":74.714979999999997},{"$f":"IF(OFFSET(Data!D108,0,(View!$B$27-1)*12)<>\"\",OFFSET(Data!D108,0,(View!$B$27-1)*12),\"\")","v":72.477080000000001},17689192.169883005,"OK",{"$f":"IF(OFFSET(Data!F108,0,(View!$B$27-1)*12)<>\"\",OFFSET(Data!F108,0,(View!$B$27-1)*12),IF($M105<>\"\",#N/A,\"\"))","v":76.496070000000003},{"$f":"IF(OFFSET(Data!G108,0,(View!$B$27-1)*12)<>\"\",OFFSET(Data!G108,0,(View!$B$27-1)*12),IF($N105<>\"\",#N/A,\"\"))","v":75.486779999999996},"OK",{"$f":"IF(OFFSET(Data!I108,0,(View!$B$27-1)*12)<>\"\",OFFSET(Data!I108,0,(View!$B$27-1)*12),IF($M105<>\"\",#N/A,\"\"))","v":77.034099999999995},{"$f":"IF(OFFSET(Data!J108,0,(View!$B$27-1)*12)<>\"\",OFFSET(Data!J108,0,(View!$B$27-1)*12),IF($N105<>\"\",#N/A,\"\"))","v":75.740780000000001},"OK"]

{"sheet":"Data","index":2,"n_rows":108,"n_cols":22,"rows_kept":108,"cut":false,"hidden":false,"merged":[]}
["MEAS0001","date","time","running_average_time","current_average_time","LEQ_warning_limit",null,null,null,null,null,null,"MEAS0002","date","time","running_average_time","current_average_time","LEQ_warning_limit"]
[null,"2021-09-30","20:18:34",15,1,105,null,null,null,null,null,null,null,"2021-10-05","09:23:14",15,1,105]
[]
["time","averaging_time","LAEQ_average","LAEQ_current","LAEQ_below_limit","LCEQ_average","LCEQ_current","LCEQ_below_limit","LZEQ_average","LZEQ_current",null,null,"time","averaging_time","LAEQ_average","LAEQ_current","LAEQ_below_limit","LCEQ_average","LCEQ_current","LCEQ_below_limit","LZEQ_average","LZEQ_current"]
["20:18:36",1,36.115540000000003,36.115540000000003,"Y",46.745420000000003,46.745420000000003,"Y",50.567880000000002,50.567880000000002,null,null,"09:23:16",1,46.546399999999998,46.546399999999998,"Y",57.599080000000001,57.599080000000001,"Y",62.182160000000003,62.182160000000003]
["20:18:37",2,68.276079999999993,71.285060000000001,"Y",69.842110000000005,72.841750000000005,"Y",69.854150000000004,72.83878,null,null,"09:23:17",2,68.796589999999995,71.793930000000003,"Y",72.736440000000002,75.679699999999997,"Y",72.947109999999995,75.771389999999997]
["20:18:38",3,69.647589999999994,71.527280000000005,"Y",72.283829999999995,74.979249999999993,"Y",72.303709999999995,75.003919999999994,null,null,"09:23:18",3,73.939350000000005,77.719679999999997,"Y",77.109639999999999,80.668660000000003,"Y",77.184200000000004,80.698480000000004]
["20:18:39",4,69.92371,70.660179999999997,"Y",72.804559999999995,74.072289999999995,"Y",72.825540000000004,74.095470000000006,null,null,"09:23:19",4,74.125870000000006,74.641710000000003,"Y",77.097790000000003,77.062020000000004,"Y",77.182590000000005,77.177710000000005]
["20:18:40",5,69.868020000000001,69.637810000000002,"Y",72.613669999999999,71.753209999999996,"Y",72.653400000000005,71.887190000000004,null,null,"09:23:20",5,73.371359999999996,67.192530000000005,"Y",76.437520000000006,71.79307,"Y",76.538889999999995,72.113399999999999]
["20:18:41",6,70.225340000000003,71.6708,"Y",72.655330000000006,72.857820000000004,"Y",72.689329999999998,72.864670000000004,null,null,"09:23:21",6,72.628799999999998,60.932110000000002,"Y",75.765230000000003,67.883740000000003,"Y",75.878200000000007,68.393289999999993]
["20:18:42",7,70.430440000000004,71.491569999999996,"Y",72.741410000000002,73.224869999999996,"Y",72.771349999999998,73.233410000000006,null,null,"09:23:22",7,72.102789999999999,65.671570000000003,"Y",75.239639999999994,68.821150000000003,"Y",75.368449999999996,69.395359999999997]
["20:18:43",8,70.154079999999993,67.478650000000002,"Y",72.63,71.75806,"Y",72.663049999999998,71.818280000000001,null,null,"09:23:23",8,71.531270000000006,53.426020000000001,"Y",74.681880000000007,60.778889999999997,"Y",74.828680000000006,63.498330000000003]
["20:18:44",9,70.253649999999993,70.977360000000004,"Y",72.597020000000001,72.323779999999999,"Y",72.630189999999999,72.357939999999999,null,null,"09:23:24",9,71.063419999999994,60.608260000000001,"Y",74.259479999999996,66.879459999999995,"Y",74.425129999999996,67.869200000000006]
["20:18:45",10,70.092330000000004,68.283850000000001,"Y",72.391559999999998,69.904330000000002,"Y",72.423900000000003,69.922759999999997,null,null,"09:23:25",10,70.79804,67.161799999999999,"Y",73.995859999999993,70.398409999999998,"Y",74.175330000000002,70.869820000000004]
["20:18:46",11,70.337260000000001,72.235950000000003,"Y",72.538880000000006,73.788899999999998,"Y",72.568849999999998,73.801640000000006,null,null,"09:23:26",11,71.966399999999993,77.228200000000001,"Y",74.654700000000005,78.470529999999997,"Y",74.80489,78.514570000000006]
["20:18:47",12,70.568449999999999,72.528220000000005,"Y",72.744510000000005,74.530550000000005,"Y",72.770830000000004,74.531390000000002,null,null,"09:23:27",12,71.967699999999994,71.981989999999996,"Y",74.560850000000002,73.367239999999995,"Y",74.710700000000003,73.512020000000007]
["20:18:48",13,70.432789999999997,68.351259999999996,"Y",72.657430000000005,71.448099999999997,"Y",72.700590000000005,71.754940000000005,null,null,"09:23:28",13,72.084530000000001,73.285319999999999,"Y",74.619770000000003,75.270780000000002,"Y",74.767719999999997,75.39931]
["20:18:49",14,70.170749999999998,62.991869999999999,"Y",72.501080000000002,69.689949999999996,"Y",72.617850000000004,71.368290000000002,null,null,"09:23:29",14,72.429969999999997,75.427189999999996,"Y",74.838809999999995,76.985680000000002,"Y",74.984759999999994,77.116439999999997]
["20:18:50",15,69.915270000000007,61.725769999999997,"Y",72.384820000000005,70.309839999999994,"Y",72.561300000000003,71.680890000000005,null,null,"09:23:30",15,72.340040000000002,70.834770000000006,"Y",74.755009999999999,73.371669999999995,"Y",74.903139999999993,73.562629999999999]
["20:18:51",16,70.347899999999996,74.190060000000003,"Y",72.614949999999993,75.104839999999996,"Y",72.77825,75.160989999999998,null,null,"09:23:31",16,72.236959999999996,70.296779999999998,"Y",74.671250000000001,73.170910000000006,"Y",74.820629999999994,73.347309999999993]
["20:18:52",17,70.968410000000006,75.924189999999996,"Y",75.055400000000006,84.019720000000007,"Y",75.506839999999997,84.782529999999994,null,null,"09:23:32",17,72.112710000000007,69.401430000000005,"Y",74.587339999999998,72.962360000000004,"Y",74.740139999999997,73.195279999999997]
["20:18:53",18,71.550799999999995,76.511020000000002,"Y",76.263800000000003,83.364239999999995,"Y",76.787149999999997,84.062929999999994,null,null,"09:23:33",18,71.892660000000006,62.554029999999997,"Y",74.417320000000004,69.485870000000006,"Y",74.57517,69.913439999999994]
["20:18:54",19,72.891369999999995,80.511020000000002,"Y",77.941410000000005,86.245750000000001,"Y",78.468360000000004,86.779229999999998,null,null,"09:23:34",19,71.859870000000001,71.222849999999994,"Y",74.40943,74.265039999999999,"Y",74.564539999999994,74.368700000000004]
["20:18:55",20,73.110219999999998,75.974159999999998,"Y",78.282160000000005,82.144940000000005,"Y",78.828599999999994,82.829459999999997,null,null,"09:23:35",20,72.129339999999999,75.439729999999997,"Y",74.688090000000003,78.07423,"Y",74.833250000000007,78.137209999999996]
["20:18:56",21,72.999960000000002,69.864019999999996,"Y",78.120590000000007,71.957980000000006,"Y",78.661159999999995,71.962569999999999,null,null,"09:23:36",21,72.140739999999994,72.362650000000002,"Y",74.699439999999996,74.920559999999995,"Y",74.850700000000003,75.18571]
["20:18:57",22,72.969139999999996,72.26549,"Y",78.008920000000003,74.569999999999993,"Y",78.53913,74.576980000000006,null,null,"09:23:37",22,71.952770000000001,60.473059999999997,"Y",74.523039999999995,65.644069999999999,"Y",74.681839999999994,66.919470000000004]
["20:18:58",23,72.846080000000001,68.500829999999993,"Y",77.847800000000007,70.113489999999999,"Y",78.374650000000003,70.158619999999999,null,null,"09:23:38",23,72.422489999999996,77.548429999999996,"Y",74.959429999999998,79.877489999999995,"Y",75.099689999999995,79.897000000000006]
[null,null,null,null,null,null,null,null,null,null,null,null,"09:23:39",24,72.536289999999994,74.563429999999997,"Y",75.05077,76.749660000000006,"Y",75.186940000000007,76.822990000000004]
[null,null,null,null,null,null,null,null,null,null,null,null,"09:23:40",25,72.432100000000005,68.636139999999997,"Y",74.958799999999997,71.827709999999996,"Y",75.096800000000002,72.057360000000003]
[null,null,null,null,null,null,null,null,null,null,null,null,"09:23:41",26,72.331620000000001,68.510249999999999,"Y",74.872569999999996,71.850809999999996,"Y",75.013720000000006,72.149529999999999]
[null,null,null,null,null,null,null,null,null,null,null,null,"09:23:42",27,72.180009999999996,61.006619999999998,"Y",74.747029999999995,68.503069999999994,"Y",74.892700000000005,69.130330000000001]
[null,null,null,null,null,null,null,null,null,null,null,null,"09:23:43",28,72.066429999999997,66.608670000000004,"Y",74.666470000000004,71.607579999999999,"Y",74.812970000000007,71.800120000000007]
[null,null,null,null,null,null,null,null,null,null,null,null,"09:23:44",29,72.053690000000003,71.680869999999999,"Y",74.656890000000004,74.379810000000006,"Y",74.804389999999998,74.557169999999999]
[null,null,null,null,null,null,null,null,null,null,null,null,"09:23:45",30,71.957509999999999,67.405910000000006,"Y",74.59742,72.379909999999995,"Y",74.782780000000002,74.104230000000001]
[null,null,null,null,null,null,null,null,null,null,null,null,"09:23:46",31,71.939729999999997,71.369129999999998,"Y",74.602559999999997,74.754140000000007,"Y",74.787959999999998,74.940259999999995]
[null,null,null,null,null,null,null,null,null,null,null,null,"09:23:47",32,71.868459999999999,68.744540000000001,"Y",74.536900000000003,71.761020000000002,"Y",74.722570000000005,71.963419999999999]
[null,null,null,null,null,null,null,null,null,null,null,null,"09:23:48",33,72.146060000000006,76.890299999999996,"Y",74.813720000000004,79.550129999999996,"Y",74.988759999999999,79.616420000000005]
[null,null,null,null,null,null,null,null,null,null,null,null,"09:23:49",34,72.465140000000005,77.699529999999996,"Y",75.234889999999993,81.309470000000005,"Y",75.393209999999996,81.34205]
[null,null,null,null,null,null,null,null,null,null,null,null,"09:23:50",35,73.153350000000003,80.922280000000001,"Y",75.847260000000006,83.22824,"Y",76.037369999999996,83.586070000000007]
[null,null,null,null,null,null,null,null,null,null,null,null,"09:23:51",36,73.471109999999996,78.873630000000006,"Y",76.081890000000001,80.616330000000005,"Y",76.290649999999999,81.036900000000003]
[null,null,null,null,null,null,null,null,null,null,null,null,"09:23:52",37,73.599699999999999,76.717879999999994,"Y",76.152760000000001,78.146529999999998,"Y",76.388580000000005,78.947770000000006]
[null,null,null,null,null,null,null,null,null,null,null,null,"09:23:53",38,73.728359999999995,76.908940000000001,"Y",76.2179,78.123530000000002,"Y",76.475470000000001,78.863259999999997]
[null,null,null,null,null,null,null,null,null,null,null,null,"09:23:54",39,73.849620000000002,76.959639999999993,"Y",76.284589999999994,78.268709999999999,"Y",76.562979999999996,79.013369999999995]
[null,null,null,null,null,null,null,null,null,null,null,null,"09:23:55",40,73.957520000000002,76.873320000000007,"Y",76.339020000000005,78.058430000000001,"Y",76.636880000000005,78.832599999999999]
[null,null,null,null,null,null,null,null,null,null,null,null,"09:23:56",41,74.060329999999993,76.928979999999996,"Y",76.394800000000004,78.185839999999999,"Y",76.709549999999993,78.920540000000003]
[null,null,null,null,null,null,null,null,null,null,null,null,"09:23:57",42,74.150509999999997,76.804630000000003,"Y",76.44171,78.026790000000005,"Y",76.771969999999996,78.772189999999995]
[null,null,null,null,null,null,null,null,null,null,null,null,"09:23:58",43,74.236919999999998,76.855260000000001,"Y",76.487769999999998,78.080759999999998,"Y",76.831770000000006,78.803120000000007]
[null,null,null,null,null,null,null,null,null,null,null,null,"09:23:59",44,74.317509999999999,76.847499999999997,"Y",76.526529999999994,77.931629999999998,"Y",76.883459999999999,78.669579999999996]
[null,null,null,null,null,null,null,null,null,null,null,null,"09:24:00",45,74.385909999999996,76.658550000000005,"Y",76.563879999999997,77.952610000000007,"Y",76.932400000000001,78.672970000000007]
[null,null,null,null,null,null,null,null,null,null,null,null,"09:24:01",46,74.445989999999995,76.536349999999999,"Y",76.590710000000001,77.652959999999993,"Y",76.970190000000002,78.399990000000003]
[null,null,null,null,null,null,null,null,null,null,null,null,"09:24:02",47,74.500159999999994,76.459819999999993,"Y",76.61318,77.538510000000002,"Y",77.003460000000004,78.310040000000001]
[null,null,null,null,null,null,null,null,null,null,null,null,"09:24:03",48,74.560509999999994,76.731449999999995,"Y",76.644480000000001,77.907359999999997,"Y",77.044880000000006,78.647069999999999]
[null,null,null,null,null,null,null,null,null,null,null,null,"09:24:04",49,74.616709999999998,76.704430000000002,"Y",76.675079999999994,77.93647,"Y",77.085480000000004,78.689089999999993]
[null,null,null,null,null,null,null,null,null,null,null,null,"09:24:05",50,74.667910000000006,76.638499999999993,"Y",76.7042,77.934539999999998,"Y",77.123580000000004,78.670990000000003]
[null,null,null,null,null,null,null,null,null,null,null,null,"09:24:06",51,74.713409999999996,76.535139999999998,"Y",76.730720000000005,77.884789999999995,"Y",77.158519999999996,78.621440000000007]
[null,null,null,null,null,null,null,null,null,null,null,null,"09:24:07",52,74.753450000000001,76.42062,"Y",76.74973,77.62312,"Y",77.191860000000005,78.622450000000001]
[null,null,null,null,null,null,null,null,null,null,null,null,"09:24:08",53,74.788669999999996,76.311620000000005,"Y",76.766909999999996,77.577849999999998,"Y",77.215829999999997,78.308790000000002]
[null,null,null,null,null,null,null,null,null,null,null,null,"09:24:09",54,74.821820000000002,76.292720000000003,"Y",76.781800000000004,77.505600000000001,"Y",77.237700000000004,78.263009999999994]
[null,null,null,null,null,null,null,null,null,null,null,null,"09:24:10",55,74.857910000000004,76.462209999999999,"Y",76.797129999999996,77.553830000000005,"Y",77.259429999999995,78.29571]
[null,null,null,null,null,null,null,null,null,null,null,null,"09:24:11",56,74.890690000000006,76.393690000000007,"Y",76.810419999999993,77.484970000000004,"Y",77.28098,78.326639999999998]
[null,null,null,null,null,null,null,null,null,null,null,null,"09:24:12",57,74.92192,76.387020000000007,"Y",76.82696,77.664969999999997,"Y",77.303910000000002,78.425989999999999]
[null,null,null,null,null,null,null,null,null,null,null,null,"09:24:13",58,74.954899999999995,76.511769999999999,"Y",76.841340000000002,77.590900000000005,"Y",77.323939999999993,78.335369999999998]
[null,null,null,null,null,null,null,null,null,null,null,null,"09:24:14",59,74.99136,76.708669999999998,"Y",76.862039999999993,77.920010000000005,"Y",77.35033,78.658289999999994]
[null,null,null,null,null,null,null,null,null,null,null,null,"09:24:15",60,75.024360000000001,76.627840000000006,"Y",76.880549999999999,77.853200000000001,"Y",77.375690000000006,78.657939999999996]
[null,null,null,null,null,null,null,null,null,null,null,null,"09:24:16",61,75.053790000000006,76.531139999999994,"Y",76.89564,77.716160000000002,"Y",77.396169999999998,78.476410000000001]
[null,null,null,null,null,null,null,null,null,null,null,null,"09:24:17",62,75.081810000000004,76.519090000000006,"Y",76.912989999999994,77.858440000000002,"Y",77.419619999999995,78.653400000000005]
[null,null,null,null,null,null,null,null,null,null,null,null,"09:24:18",63,75.108199999999997,76.493219999999994,"Y",76.928539999999998,77.797960000000003,"Y",77.440129999999996,78.55274]
[null,null,null,null,null,null,null,null,null,null,null,null,"09:24:19",64,75.136259999999993,76.615430000000003,"Y",76.943169999999995,77.777860000000004,"Y",77.459500000000006,78.532510000000002]
[null,null,null,null,null,null,null,null,null,null,null,null,"09:24:20",65,75.164730000000006,76.681759999999997,"Y",76.958160000000007,77.823539999999994,"Y",77.478679999999997,78.557779999999994]
[null,null,null,null,null,null,null,null,null,null,null,null,"09:24:21",66,75.187970000000007,76.481549999999999,"Y",76.968609999999998,77.599299999999999,"Y",77.493099999999998,78.340519999999998]
[null,null,null,null,null,null,null,null,null,null,null,null,"09:24:22",67,75.211190000000002,76.520520000000005,"Y",76.98424,77.907920000000004,"Y",77.511989999999997,78.606070000000003]
[null,null,null,null,null,null,null,null,null,null,null,null,"09:24:23",68,75.232219999999998,76.450069999999997,"Y",76.995450000000005,77.687730000000002,"Y",77.526499999999999,78.402699999999996]
[null,null,null,null,null,null,null,null,null,null,null,null,"09:24:24",69,75.251400000000004,76.389449999999997,"Y",77.006529999999998,77.700090000000003,"Y",77.54074,78.413539999999998]
[null,null,null,null,null,null,null,null,null,null,null,null,"09:24:25",70,75.268940000000001,76.334419999999994,"Y",77.014210000000006,77.513900000000007,"Y",77.551739999999995,78.250429999999994]
[null,null,null,null,null,null,null,null,null,null,null,null,"09:24:26",71,75.286720000000003,76.379329999999996,"Y",77.023669999999996,77.639049999999997,"Y",77.564760000000007,78.390820000000005]
[null,null,null,null,null,null,null,null,null,null,null,null,"09:24:27",72,75.301640000000006,76.248059999999995,"Y",77.030940000000001,77.519120000000001,"Y",77.576520000000002,78.338750000000005]
[null,null,null,null,null,null,null,null,null,null,null,null,"09:24:28",73,75.31832,76.377210000000005,"Y",77.039619999999999,77.622320000000002,"Y",77.587710000000001,78.326160000000002]
[null,null,null,null,null,null,null,null,null,null,null,null,"09:24:29",74,75.338200000000001,76.587850000000003,"Y",77.049030000000002,77.686580000000006,"Y",77.601309999999998,78.494380000000007]
[null,null,null,null,null,null,null,null,null,null,null,null,"09:24:30",75,75.361059999999995,76.786280000000005,"Y",77.064160000000001,78.058430000000001,"Y",77.619709999999998,78.801730000000006]
[null,null,null,null,null,null,null,null,null,null,null,null,"09:24:31",76,75.394289999999998,77.357990000000001,"Y",77.086370000000002,78.493279999999999,"Y",77.645809999999997,79.257580000000004]
[null,null,null,null,null,null,null,null,null,null,null,null,"09:24:32",77,75.45626,78.630099999999999,"Y",77.135379999999998,79.813929999999999,"Y",77.69802,80.504279999999994]
[null,null,null,null,null,null,null,null,null,null,null,null,"09:24:33",78,75.520449999999997,78.803470000000004,"Y",77.187119999999993,80.001639999999995,"Y",77.752099999999999,80.658779999999993]
[null,null,null,null,null,null,null,null,null,null,null,null,"09:24:34",79,75.560389999999998,77.900790000000001,"Y",77.222359999999995,79.34496,"Y",77.789140000000003,79.996600000000001]
[null,null,null,null,null,null,null,null,null,null,null,null,"09:24:35",80,75.505799999999994,44.192050000000002,"Y",77.168660000000003,59.491709999999998,"Y",77.738050000000001,65.886600000000001]
[null,null,null,null,null,null,null,null,null,null,null,null,"09:24:36",81,75.461590000000001,68.04674,"Y",77.134190000000004,72.729150000000004,"Y",77.702100000000002,72.950760000000002]
[null,null,null,null,null,null,null,null,null,null,null,null,"09:24:37",82,75.444559999999996,73.781850000000006,"Y",77.120369999999994,75.822940000000003,"Y",77.68432,75.931100000000001]
[null,null,null,null,null,null,null,null,null,null,null,null,"09:24:38",83,75.414540000000002,71.759450000000001,"Y",77.094800000000006,74.21987,"Y",77.65625,74.361660000000001]
[null,null,null,null,null,null,null,null,null,null,null,null,"09:24:39",84,75.377930000000006,70.112650000000002,"Y",77.057950000000005,71.722669999999994,"Y",77.618210000000005,71.927430000000001]
[null,null,null,null,null,null,null,null,null,null,null,null,"09:24:40",85,75.326930000000004,54.182169999999999,"Y",77.008759999999995,63.365119999999997,"Y",77.569630000000004,64.970209999999994]
[null,null,null,null,null,null,null,null,null,null,null,null,"09:24:41",86,75.289860000000004,69.628460000000004,"Y",76.983699999999999,74.043819999999997,"Y",77.542379999999994,74.218149999999994]
[null,null,null,null,null,null,null,null,null,null,null,null,"09:24:42",87,75.245800000000003,66.149050000000003,"Y",76.945490000000007,70.746120000000005,"Y",77.503619999999998,71.105140000000006]
[null,null,null,null,null,null,null,null,null,null,null,null,"09:24:43",88,75.205020000000005,67.73254,"Y",76.909930000000003,71.454070000000002,"Y",77.466989999999996,71.664829999999995]
[null,null,null,null,null,null,null,null,null,null,null,null,"09:24:44",89,75.156909999999996,58.165080000000003,"Y",76.863380000000006,64.001890000000003,"Y",77.420829999999995,65.181039999999996]
[null,null,null,null,null,null,null,null,null,null,null,null,"09:24:45",90,75.161640000000006,75.562989999999999,"Y",76.87773,77.995599999999996,"Y",77.428169999999994,78.036659999999998]
[null,null,null,null,null,null,null,null,null,null,null,null,"09:24:46",91,75.130709999999993,70.652630000000002,"Y",76.849450000000004,72.999179999999996,"Y",77.398210000000006,73.160659999999993]
[null,null,null,null,null,null,null,null,null,null,null,null,"09:24:47",92,75.100880000000004,70.814959999999999,"Y",76.830370000000002,74.606160000000003,"Y",77.376800000000003,74.783299999999997]
[null,null,null,null,null,null,null,null,null,null,null,null,"09:24:48",93,75.057980000000001,64.437100000000001,"Y",76.790459999999996,68.572180000000003,"Y",77.336849999999998,69.087689999999995]
[null,null,null,null,null,null,null,null,null,null,null,null,"09:24:49",94,75.011750000000006,51.964359999999999,"Y",76.745729999999995,62.442259999999997,"Y",77.292689999999993,64.246380000000002]
[null,null,null,null,null,null,null,null,null,null,null,null,"09:24:50",95,74.967439999999996,60.516330000000004,"Y",76.703670000000002,66.006150000000005,"Y",77.251050000000006,67.001140000000007]
[null,null,null,null,null,null,null,null,null,null,null,null,"09:24:51",96,74.922659999999993,56.831110000000002,"Y",76.661929999999998,65.840239999999994,"Y",77.209500000000006,66.588920000000002]
[null,null,null,null,null,null,null,null,null,null,null,null,"09:24:52",97,74.882750000000001,65.439899999999994,"Y",76.628200000000007,70.635170000000002,"Y",77.17653,71.465770000000006]
[null,null,null,null,null,null,null,null,null,null,null,null,"09:24:53",98,74.870249999999999,73.446370000000002,"Y",76.620459999999994,75.794820000000001,"Y",77.165570000000002,75.944559999999996]
[null,null,null,null,null,null,null,null,null,null,null,null,"09:24:54",99,74.87585,75.392520000000005,"Y",76.633960000000002,77.787279999999996,"Y",77.172619999999995,77.813069999999996]
[null,null,null,null,null,null,null,null,null,null,null,null,"09:24:55",100,74.839579999999998,67.13449,"Y",76.603710000000007,71.486509999999996,"Y",77.142349999999993,72.022440000000003]
[null,null,null,null,null,null,null,null,null,null,null,null,"09:24:56",101,74.801190000000005,65.296819999999997,"Y",76.571460000000002,70.631500000000003,"Y",77.110699999999994,71.401809999999998]
[null,null,null,null,null,null,null,null,null,null,null,null,"09:24:57",102,74.758690000000001,53.10895,"Y",76.530410000000003,62.651919999999997,"Y",77.071370000000002,66.160420000000002]
[null,null,null,null,null,null,null,null,null,null,null,null,"09:24:58",103,74.731930000000006,70.408100000000005,"Y",76.504800000000003,72.490380000000002,"Y",77.04495,72.815870000000004]
[null,null,null,null,null,null,null,null,null,null,null,null,"09:24:59",104,74.714979999999997,72.477080000000001,"Y",76.496070000000003,75.486779999999996,"Y",77.034099999999995,75.740780000000001]

{"sheet":"Meas0002","index":3,"n_rows":105,"n_cols":6,"rows_kept":105,"cut":false,"hidden":false,"merged":[]}
["Time (s)","Peak","Slow","10^(L1/10)"]
[0,68.415000000000006,43.835999999999999,{"$f":"10^(C2/10)","v":24188.002231478433},"Laeq =",{"$f":"10*LOG10(SUM(D2:D105)/COUNT(D2:D105))","v":74.712321349280145}]
[1,92.772000000000006,71.277000000000001,{"$f":"10^(C3/10)","v":13418377.322533764}]
[2,95.105999999999995,75.629000000000005,36551061.999238923]
[3,92.257000000000005,74.524000000000001,28340010.055091005]
[4,82.796000000000006,71.266999999999996,13387515.911086982]
[5,76.222999999999999,67.558999999999997,5700330.0221896078]
[6,81.045000000000002,66.111999999999995,4085074.676631249]
[7,73.034999999999997,62.134,1634556.7371975668]
[8,77.034000000000006,60.926000000000002,1237656.1379855953]
[9,83.45,66.697999999999993,4675197.9088450735]
[10,93.066000000000003,75.929000000000002,39165168.559121162]
[11,85.751000000000005,73.486000000000004,22315159.738717735]
[12,90.858000000000004,73.55,22646443.075930614]
[13,89.242999999999995,74.474000000000004,28015604.642568979]
[14,84.876999999999995,72.290999999999997,16947279.810629878]
[15,85.058999999999997,70.683999999999997,11705770.359631363]
[16,84.688000000000002,69.912999999999997,9801668.2686628401]
[17,78.397999999999996,66.555999999999997,4524806.3785554878]
[18,86.87,70.64,11587773.561551293]
[19,90.742999999999995,73.433999999999997,22049563.679696333]
[20,86.370999999999995,72.382000000000005,17306131.525419399]
[21,82.08,68.399000000000001,6916716.8928956604]
[22,91.873999999999995,77.010000000000005,50234258.952238798]
[23,89.206999999999994,75.626000000000005,36525822.138633877]
[24,84.116,72.444000000000003,17554966.296212368]
[25,85.254000000000005,70.599000000000004,11478892.797901837]
[26,78.542000000000002,66.88,4875284.9010338653]
[27,83.944999999999993,66.992000000000004,5002648.6242100736]
[28,86.224999999999994,69.671999999999997,9272567.4258059654]
[29,83.754999999999995,68.724000000000004,7454182.1337899305]
[30,87.287999999999997,71.396000000000001,13791134.690236036]
[31,85.667000000000002,69.688000000000002,9306791.8316265345]
[32,94.236999999999995,75.95,39355007.545577824]
[33,92.578999999999994,76.766999999999996,47500698.938311987]
[34,96.638999999999996,80.072000000000003,101671680.04663789]
[35,94.545000000000002,79.088999999999999,81077434.866607413]
[36,88.989000000000004,77.790999999999997,60131217.878993452]
[37,89.225999999999999,77.299000000000007,53690815.44647222]
[38,89.361000000000004,77.117999999999995,51499142.764786623]
[39,88.584000000000003,77.024000000000001,50396456.36126443]
[40,89.138000000000005,76.997,50084114.529982433]
[41,89.546999999999997,76.896000000000001,48932792.408193931]
[42,89.817999999999998,76.902000000000001,49000442.279323645]
[43,90.441000000000003,76.917000000000002,49169976.41778747]
[44,89.007999999999996,76.783000000000001,47676020.736749671]
[45,89.424000000000007,76.643000000000001,46163635.154046871]
[46,89.26,76.582999999999998,45530246.334600188]
[47,89.784000000000006,76.751999999999995,47336920.334830225]
[48,89.106999999999999,76.756,47380539.333882615]
[49,89.641000000000005,76.727999999999994,47076048.325658336]
[50,88.784000000000006,76.62,45919801.283686988]
[51,89.013000000000005,76.515000000000001,44822904.999662235]
[52,88.980999999999995,76.400999999999996,43661635.52976837]
[53,88.924000000000007,76.382999999999996,43481047.689272687]
[54,88.998000000000005,76.486999999999995,44534850.626985893]
[55,89.650999999999996,76.465000000000003,44309821.448930077]
[56,88.132999999999996,76.48,44463126.746911034]
[57,88.524000000000001,76.552000000000007,45206407.964850225]
[58,89.475999999999999,76.704999999999998,46827395.137360014]
[59,89.477999999999994,76.674999999999997,46505037.616660692]
[60,88.078999999999994,76.616,45877527.054713689]
[61,89.143000000000001,76.581000000000003,45509283.708495609]
[62,88.971000000000004,76.566000000000003,45352371.345144659]
[63,89.355000000000004,76.644999999999996,46184899.189524852]
[64,89.334999999999994,76.697999999999993,46751979.088450789]
[65,89.494,76.616,{"$f":"10^(C67/10)","v":45877527.054713689}]
[66,89.194000000000003,76.587000000000003,45572200.558864802]
[67,89.391000000000005,76.539000000000001,45071291.210911021]
[68,88.796000000000006,76.472999999999999,44391518.378955193]
[69,88.477999999999994,76.442999999999998,44085929.315913141]
[70,88.941999999999993,76.430999999999997,43964283.528788984]
[71,89.370999999999995,76.337999999999994,43032839.130577728]
[72,89.786000000000001,76.400000000000006,43651583.224016666]
[73,89.98,76.581000000000003,45509283.708495609]
[74,89.087000000000003,76.77,47533522.594280489]
[75,90.590999999999994,77.245999999999995,53039570.669453613]
[76,91.582999999999998,78.242000000000004,66711391.57966499]
[77,90.751999999999995,78.647000000000006,73231849.068616524]
[78,91.965999999999994,77.908000000000001,61773185.859152056]
[79,63.579000000000001,73.567999999999998,22740499.508959014]
[80,86.924999999999997,70.962999999999994,12482454.739245361]
[81,90.540999999999997,72.311000000000007,17025504.900025111]
[82,89.051000000000002,71.988,15805200.152842596]
[83,90.626000000000005,70.334999999999994,10801896.208818916]
[84,77.298000000000002,66.25,4216965.0342858257]
[85,85.185000000000002,68.114000000000004,6477389.3069563778]
[86,81.655000000000001,67.320999999999998,5396348.6373006934]
[87,80.48,67.421999999999997,5523317.3888728525]
[88,77.888999999999996,63.744999999999997,2368645.1317841378]
[89,91.289000000000001,72.765000000000001,18901662.311869014]
[90,86.194000000000003,71.266999999999996,13387515.911086982]
[91,86.236000000000004,70.954999999999998,12459482.372707495]
[92,82.951999999999998,67.613,5771650.1719023259]
[93,68.239999999999995,63.503,2240268.1265938752]
[94,77.290999999999997,62.036000000000001,1598085.4594730919]
[95,71.661000000000001,59.411000000000001,873172.40061786259]
[96,85.578000000000003,65.399000000000001,3466570.2053333954]
[97,90.114999999999995,71.349999999999994,13645831.365889236]
[98,89.308000000000007,74.239999999999995,26546055.61975538]
[99,82.286000000000001,71.218000000000004,13237317.937881945]
[100,82.102000000000004,68.209999999999994,6622165.0370176276]
[101,72.656000000000006,64.054000000000002,2543314.1059879404]
[102,89.929000000000002,69.572000000000003,9061498.0223199986]
[103,89.771000000000001,70.304000000000002,10725066.656157045]